{"text_format":"1","workbook":"xlsx","n_sheets":14,"sheets":["INDICE","F1. INF. GENERAL","F2. COMP. LAB Y COM COMPOR","Hoja4","F3. EVIDENCIAS","F4. CALF. COM. COMPORT.","F5. EVA. ÁREAS O DEPENDENCIAS.","F6. REPOR CLF PRD SEMESTRAL","F7. PLAN DE MEJORAMIENTO","F8. EVA. EVENTUAL","F9. EV. EXTRAORDINARIA","F10. EVA. INFERIOR AL SEMESTRE","F11. EVA P. PRUEBA","F. EVA ÁREAS O DEP, CACI"],"not_rendered":{"charts":0,"images":12,"macros":1,"external_links":5,"defined_names":51,"comments":2,"pivot_tables":0},"unopened":[],"bounds":{"document_bytes":16777216,"sheet_cells":100000,"rows_first":2000,"rows_last":500,"rows_between":2000,"halvings":0,"cell_chars":16384,"cell_head_chars":4096},"cells_cut":0,"cells_raw":0,"read":"whole","date_system":"1900"}

{"sheet":"INDICE","index":0,"n_rows":45,"n_cols":18,"rows_kept":45,"cut":false,"hidden":false,"merged":[[41,12,41,16],[42,12,42,16],[40,12,40,16],[41,4,41,10],[42,4,42,10],[33,12,34,16],[32,12,32,16],[36,12,36,16],[37,12,37,16],[36,4,36,10],[35,12,35,16],[43,0,45,2],[26,2,42,2],[32,67,32,70],[35,4,35,10],[37,4,37,10],[38,4,38,10],[33,67,33,82],[34,66,35,66],[38,12,38,16],[39,12,39,16],[32,71,32,82],[32,3,32,10],[33,4,33,10],[26,3,31,65],[39,4,39,10],[40,4,40,10],[43,3,43,65],[44,3,45,65],[7,15,9,16],[10,15,12,16],[7,17,8,18],[10,17,12,18],[13,3,15,3],[11,4,12,4],[13,15,15,16],[13,17,15,18],[11,3,12,3],[16,3,17,3],[13,4,15,4],[16,4,18,4],[33,11,34,11],[34,4,34,10],[32,17,32,65],[41,17,42,65],[40,17,40,65],[36,17,39,65],[35,17,35,65],[33,17,34,65]]}
[]
[]
[]
[]
[]
[]
[]
[]
[]
[]
[]
[]
[]
[]
[]
[]
[]
[]
[]
[]
[]
[]
[]
[]
[]
[]
[null,null,null,"\nINSTRUCIONES BÁSICAS PARA EL DILIGENCIAMIENTO DE LOS FORMATOS CORRESPONDIENTES AL PERÍODO SEMESTRAL"]
[]
[]
[]
[]
[]
[null,null,null,"PROCEDIMIENTO",null,null,null,null,null,null,null,"Nº","FORMATOS",null,null,null,null,"FASE"]
[null,null,null,"PASO 1. ","Diligenciar  la información personal y de los empleos de los evaluadores y del evaluado.",null,null,null,null,null,null,"F2. ","Compromisos laborales y competencias comportamentales ",null,null,null,null,"FASE II. CONCERTACIÓN DE COMPROMISOS LABORALES Y COMPETENCIAS COMPORTAMENTALES"]
[null,null,null,"PASO 2.","Concertar a mas tardar el 31 de enero o julio de cada año los compromisos laborales y competencias comportamentales para cada evaluación semestral definitiva realizada durante el año."]
[null,null,null,"PASO 3. ","Acopiar durante todo el proceso de evaluación las evidencias especificando la ubicación y fecha de aporte.",null,null,null,null,null,null,"F3."," Evidencias",null,null,null,null,"FASE III. SEGUIMIENTO AL DESEMPEÑO LABORAL Y AL DESARROLLO DE LAS COMPETENCIAS COMPORTAMENTALES."]
[null,null,null,"PASO 4. ","Efectuar la evaluación semestral la cual comprende del primero (1º) de enero hasta el treinta y uno (30) de junio de cada año donde la calificación de los compromisos laborales deberá producirse en el mes de agosto de cada anualidad.\nEfectuar la evaluación semestral la cual comprende del primero (1º) de julio hasta el (31) diciembre de cada año donde la calificación de los compromisos laborales deberá producirse en el mes de febrero de la siguiente anualidad.",null,null,null,null,null,null,"F1."," Información general",null,null,null,null,"IV FASE. EVALUACIONES PARCIALES EN PERÍODO SEMESTRAL U ORDINARIO"]
[null,null,null,"PASO 5. ","Efectuar la calificación de las competencias comportamentales correspondientes al semestre. (las fechas proceden igual que lo especificado en el ítem anterior)",null,null,null,null,null,null,"F4."," Calificación competencias comportamentales"]
[null,null,null,"PASO 6. ","Comunicar  la calificación dos días después de efectuada.",null,null,null,null,null,null,"F6. ","Reporte de calificaciones período semestral u ordinario"]
[null,null,null,"PASO 7. ","Implementar de ser necesario el plan de mejoramiento de acuerdo al resultado del seguimiento o la evaluación.",null,null,null,null,null,null,"F7.","Plan de mejoramiento"]
[null,null,null,"PASO 8. ","Acopiar durante todo el proceso de evaluación las evidencias especificando la ubicación y fecha de aporte.",null,null,null,null,null,null,"F3. ","Evidencias",null,null,null,null,"FASE III. SEGUIMIENTO AL DESEMPEÑO LABORAL Y AL DESARROLLO DE LAS COMPETENCIAS COMPORTAMENTALES."]
[null,null,null,"PASO 9. ","Registrar el resultado de las evaluación de gestión por áreas o dependencias de acuerdo con la información del formato (F5.  EVA. ÁREAS O DEPENDENCIAS).",null,null,null,null,null,null,"F1.","Información general",null,null,null,null,"V FASE. CALIFICACIÓN DEFINITIVA"]
[null,null,null,"PASO 10. ","Notificar la calificación final, en el caso de presentarse recursos diligenciar la sección V y VI del formato.",null,null,null,null,null,null,"F6.","Reporte de calificaciones período semestral u ordinario"]
[]
[null,null,null,"Estos formatos constituyen una ayuda metodológica para la aplicación del Sistema Tipo de Evaluación de Desempeño Laboral establecido a través del Acuerdo No. 565 de 2016, proferido por la CNSC.\nLos presentes documentos podrán ser susceptibles de modificación.\nLos formatos cuentan con clave de protección. En caso de tener algún inconveniente con el formato comuníquese con el Grupo de Talento Humano de la Superintendencia de Industria y Comercio."]

{"sheet":"F1. INF. GENERAL","index":1,"n_rows":59,"n_cols":19,"rows_kept":59,"cut":false,"hidden":false,"merged":[[49,11,50,14],[49,15,50,18],[51,5,51,8],[52,5,52,8],[53,5,53,8],[54,5,54,8],[55,5,55,8],[53,1,53,4],[55,11,56,18],[54,9,56,10],[48,9,53,10],[53,11,53,14],[53,15,53,18],[50,1,50,4],[51,1,51,4],[51,11,52,18],[52,1,52,4],[54,0,54,4],[55,0,55,4],[54,11,54,14],[54,15,54,18],[59,0,59,6],[59,7,59,12],[59,13,59,18],[57,0,57,18],[58,9,58,11],[56,5,56,8],[58,0,58,2],[58,3,58,5],[58,6,58,8],[58,12,58,15],[58,16,58,18],[56,0,56,4],[46,14,47,14],[46,15,47,17],[46,18,47,18],[46,11,47,13],[49,5,49,8],[50,5,50,8],[40,0,41,3],[40,4,41,8],[40,9,41,10],[42,0,42,8],[42,9,42,10],[44,0,45,10],[45,11,45,14],[45,15,45,18],[43,0,43,10],[44,11,44,18],[42,11,42,14],[42,15,42,18],[43,11,43,14],[43,15,43,18],[46,0,47,10],[48,0,48,8],[48,11,48,18],[49,0,49,4],[38,0,39,3],[38,4,39,8],[38,9,39,10],[38,11,39,14],[40,11,41,14],[38,15,39,18],[40,15,41,18],[36,0,37,3],[36,4,37,8],[36,9,37,10],[34,0,35,3],[34,4,35,8],[34,9,35,10],[34,11,35,14],[36,11,37,14],[34,15,35,18],[36,15,37,18],[32,0,33,3],[32,4,33,8],[32,9,33,10],[27,0,27,18],[28,0,31,3],[28,4,31,8],[28,9,31,10],[28,11,29,18],[30,11,30,18],[31,11,31,14],[32,11,33,14],[31,15,31,18],[32,15,33,18],[25,17,25,18],[26,0,26,5],[26,13,26,14],[26,15,26,16],[26,17,26,18],[25,0,25,5],[25,13,25,14],[25,15,25,16],[26,6,26,12],[25,6,25,12],[24,0,24,1],[24,2,24,4],[24,5,24,7],[24,8,24,10],[24,11,24,14],[24,15,24,18],[22,0,22,18],[23,0,23,1],[23,2,23,4],[23,5,23,7],[23,8,23,10],[23,11,23,14],[23,15,23,18],[20,17,20,18],[21,0,21,5],[21,13,21,14],[21,15,21,16],[21,17,21,18],[20,0,20,5],[20,13,20,14],[20,15,20,16],[21,6,21,12],[20,6,20,12],[19,0,19,1],[19,2,19,4],[19,5,19,7],[19,8,19,10],[19,11,19,14],[19,15,19,18],[18,0,18,1],[18,2,18,4],[18,5,18,7],[18,8,18,10],[18,11,18,14],[18,15,18,18],[15,0,15,4],[15,5,15,6],[16,0,16,4],[16,5,16,6],[17,0,17,18],[13,0,13,7],[14,0,14,7],[14,8,14,18],[13,8,13,18],[15,8,16,8],[15,9,16,18],[12,0,12,1],[12,2,12,4],[12,5,12,7],[12,8,12,10],[12,11,12,14],[12,15,12,18],[8,0,9,3],[8,7,9,8],[8,12,9,15],[10,0,10,18],[11,0,11,1],[11,2,11,4],[11,5,11,7],[11,8,11,10],[11,11,11,14],[11,15,11,18],[1,0,6,3],[1,4,2,14],[1,15,7,18],[3,4,4,14],[5,4,6,6],[6,7,6,8],[6,9,6,10],[7,0,7,14],[6,11,6,12],[5,7,5,8],[5,9,5,10],[5,11,5,12],[5,13,5,14],[6,13,6,14]]}
[]
[null,null,null,null,"COMISIÓN NACIONAL DEL SERVICIO CIVIL"]
[]
[null,null,null,null,"FORMATO 1. INFORMACIÓN GENERAL"]
[]
[null,null,null,null,"PROCESO: EVALUACIÓN DEL DESEMPEÑO LABORAL",null,null,"Código:  ",null,"F-ED-002",null,"Página",null,"1 de 1"]
[null,null,null,null,null,null,null,"Fecha de emisión: ",null,"2016-02-10",null,"Versión: ",null,"1.0"]
[]
["PERÍODO DE EVALUACIÓN",null,null,null,"DÍA","MES","AÑO","al",null,"DÍA","MES","AÑO","FECHA CONCERTACIÓN O AJUSTE DE COMPROMISOS",null,null,null,"DÍA","MES","AÑO"]
[]
["I. IDENTIFICACIÓN DEL EVALUADO"]
["Tipo de Documento",null,"Número de identificación",null,null,"Primer apellido",null,null,"Segundo apellido",null,null,"Primer nombre",null,null,null,"Otros nombres"]
[{"$f":"'F2. COMP. LAB Y COM COMPOR'!A13:B13","v":"CÉDULA DE CIUDADANÍA"},null,{"$f":"'F2. COMP. LAB Y COM COMPOR'!C13:E13","v":0},null,null,{"$f":"'F2. COMP. LAB Y COM COMPOR'!F13:H13","v":""},null,null,{"$f":"'F2. COMP. LAB Y COM COMPOR'!I13:K13","v":""},null,null,{"$f":"'F2. COMP. LAB Y COM COMPOR'!L13:O13","v":""},null,null,null,{"$f":"'F2. COMP. LAB Y COM COMPOR'!P13:S13","v":""}]
["Dependencia o área a la que pertenece el evaluado",null,null,null,null,null,null,null,"Denominación del empleo"]
[{"$f":"'F2. COMP. LAB Y COM COMPOR'!A15:H15","v":""},null,null,null,null,null,null,null,{"$f":"'F2. COMP. LAB Y COM COMPOR'!I15:S15","v":""}]
["Nivel jerárquico",null,null,null,null,"Código",null,"Grado",{"$f":"'F2. COMP. LAB Y COM COMPOR'!I16:S17","v":"Propósito del empleo:"},{"$f":"'F2. COMP. LAB Y COM COMPOR'!J16:S17","v":0}]
[{"$f":"'F2. COMP. LAB Y COM COMPOR'!A17:E17","v":""},null,null,null,null,{"$f":"'F2. COMP. LAB Y COM COMPOR'!F17:G17","v":""},null,{"$f":"'F2. COMP. LAB Y COM COMPOR'!H17","v":""}]
["II. IDENTIFICACIÓN EVALUADOR. (Jefe inmediato)"]
["Tipo de documento",null,"Número de identificación",null,null,"Primer apellido",null,null,"Segundo apellido",null,null,"Primer nombre",null,null,null,"Otros nombres"]
[{"$f":"'F2. COMP. LAB Y COM COMPOR'!A20:B20","v":"CEDULA DE CIUDADANIA"},null,{"$f":"'F2. COMP. LAB Y COM COMPOR'!C20:E20","v":0},null,null,{"$f":"'F2. COMP. LAB Y COM COMPOR'!F20:H20","v":""},null,null,{"$f":"'F2. COMP. LAB Y COM COMPOR'!I20:K20","v":""},null,null,{"$f":"'F2. COMP. LAB Y COM COMPOR'!L20:O20","v":""},null,null,null,{"$f":"'F2. COMP. LAB Y COM COMPOR'!P20:S20","v":""}]
[" Área o Dependencia a la que pertenece el evaluador",null,null,null,null,null,"Denominación del empleo",null,null,null,null,null,null,"Código",null,"Grado",null,"Nivel jerárquico"]
[{"$f":"'F2. COMP. LAB Y COM COMPOR'!A22:F22","v":""},null,null,null,null,null,{"$f":"'F2. COMP. LAB Y COM COMPOR'!G22:M22","v":""},null,null,null,null,null,null,{"$f":"'F2. COMP. LAB Y COM COMPOR'!N22:O22","v":""},null,{"$f":"'F2. COMP. LAB Y COM COMPOR'!P22:Q22","v":""},null,{"$f":"'F2. COMP. LAB Y COM COMPOR'!R22:S22","v":""}]
["III. IDENTIFICACIÓN EVALUADOR (Servidor público de Libre Nombramiento y Remoción en caso de constituir Comisión Evaluadora)"]
["Tipo de documento",null,"Número de identificación",null,null,"Primer apellido",null,null,"Segundo apellido",null,null,"Primer nombre",null,null,null,"Otros nombres"]
[{"$f":"'F2. COMP. LAB Y COM COMPOR'!A25:B25","v":"CEDULA DE CIUDADANIA"},null,{"$f":"'F2. COMP. LAB Y COM COMPOR'!C25:E25","v":0},null,null,{"$f":"'F2. COMP. LAB Y COM COMPOR'!F25:H25","v":""},null,null,{"$f":"'F2. COMP. LAB Y COM COMPOR'!I25:K25","v":""},null,null,{"$f":"'F2. COMP. LAB Y COM COMPOR'!L25:O25","v":""},null,null,null,{"$f":"'F2. COMP. LAB Y COM COMPOR'!P25:S25","v":""}]
["Dependencia o área a la que pertenece el evaluador",null,null,null,null,null,"Denominación del empleo",null,null,null,null,null,null,"Código",null,"Grado",null,"Nivel jerárquico"]
[{"$f":"'F2. COMP. LAB Y COM COMPOR'!A27:F27","v":""},null,null,null,null,null,{"$f":"'F2. COMP. LAB Y COM COMPOR'!G27:M27","v":""},null,null,null,null,null,null,{"$f":"'F2. COMP. LAB Y COM COMPOR'!N27:O27","v":""},null,{"$f":"'F2. COMP. LAB Y COM COMPOR'!P27:Q27","v":""},null,{"$f":"'F2. COMP. LAB Y COM COMPOR'!R27:S27","v":""}]
["IV. COMPROMISOS LABORALES"]
["Metas de la Dependencia a las cuales contribuye el empleo",null,null,null,"Compromisos Laborales.",null,null,null,null,"Peso porcentual del compromiso",null,"Porcentaje de Cumplimiento. "]
[]
[null,null,null,null,null,null,null,null,null,null,null,"EVALUACIÓN SEMESTRAL"]
[null,null,null,null,null,null,null,null,null,null,null,"CALIFICACIÓN DEL COMPROMISO",null,null,null,"CALIFICACIÓN DEL COMPROMISO (Con peso porcentual)"]
[{"$f":"'F2. COMP. LAB Y COM COMPOR'!A36","v":0},null,null,null,{"$f":"'F2. COMP. LAB Y COM COMPOR'!H36","v":0},null,null,null,null,{"$f":"'F2. COMP. LAB Y COM COMPOR'!Q36","v":0},null,null,null,null,null,{"$f":"$J33*L33","v":0}]
[]
[{"$f":"'F2. COMP. LAB Y COM COMPOR'!A38","v":0},null,null,null,{"$f":"'F2. COMP. LAB Y COM COMPOR'!$H$38","v":0},null,null,null,null,{"$f":"'F2. COMP. LAB Y COM COMPOR'!Q38","v":0},null,null,null,null,null,{"$f":"$J35*L35","v":0}]
[]
[{"$f":"'F2. COMP. LAB Y COM COMPOR'!A40","v":0},null,null,null,{"$f":"'F2. COMP. LAB Y COM COMPOR'!$H$40","v":0},null,null,null,null,{"$f":"'F2. COMP. LAB Y COM COMPOR'!Q40","v":0},null,null,null,null,null,{"$f":"$J37*L37","v":0}]
[]
[{"$f":"'F2. COMP. LAB Y COM COMPOR'!A42","v":0},null,null,null,{"$f":"'F2. COMP. LAB Y COM COMPOR'!$H$42","v":0},null,null,null,null,{"$f":"'F2. COMP. LAB Y COM COMPOR'!Q42","v":0},null,null,null,null,null,{"$f":"$J39*L39","v":0}]
[]
[{"$f":"'F2. COMP. LAB Y COM COMPOR'!A44","v":0},null,null,null,{"$f":"'F2. COMP. LAB Y COM COMPOR'!$H$44","v":0},null,null,null,null,{"$f":"'F2. COMP. LAB Y COM COMPOR'!Q44","v":0},null,null,null,null,null,{"$f":"$J41*L41","v":0}]
[]
[" TOTALES",null,null,null,null,null,null,null,null,{"$f":"SUM(J33:K42)","v":0},null,"Resultado total ",null,null,null,{"$f":"IF(P44>0,\"\",SUMIF(P33:S42,\"<100\",P33:S42))","v":0}]
["Totales Parciales Semestrales con Eventuales",null,null,null,null,null,null,null,null,null,null,"Resultado Evaluaciones Eventuales",null,null,null,{"$f":"'F8. EVA. EVENTUAL'!K45","v":0}]
["Calificaciones parciales semestrales compromisos laborales ",null,null,null,null,null,null,null,null,null,null,"Calificación total"]
[null,null,null,null,null,null,null,null,null,null,null,{"$f":"O43*40","v":0},null,null,null,{"$f":"S43*40","v":0}]
["CALIFICACIÒN TOTAL DE LOS COMPROMISOS LABORALES",null,null,null,null,null,null,null,null,null,null,"Sobre el 100%",null,null,{"$f":"IF(P43=\"\",P44,P43)","v":0},"Sobre el peso porcentual del 80%",null,null,{"$f":"+O47*80%","v":0}]
[]
["V. COMPETENCIAS COMPORTAMENTALES",null,null,null,null,null,null,null,null,"F5. EVA. ÁREAS O DEPENDENCIAS.'!A1",null,"VI. EVALUACIÓN DE GESTIÓN POR ÁREAS O DEPENDENCIAS"]
["COMPETENCIAS COMPORTAMENTALES",null,null,null,null,"Evaluación Semestral",null,null,null,null,null,"CALIFICACIÓN DE LA EVALUACIÓN DE GESTIÓN POR ÁREAS O  DEPENDENCIAS."]
["1.  ",{"$f":"'F2. COMP. LAB Y COM COMPOR'!B50","v":0},null,null,null,{"$f":"'F4. CALF. COM. COMPORT.'!N32","v":""}]
["2. ",{"$f":"'F2. COMP. LAB Y COM COMPOR'!B52","v":0},null,null,null,{"$f":"'F4. CALF. COM. COMPORT.'!N34","v":""},null,null,null,null,null,"VI. EVALUACIÓN DE GESTIÓN POR ÁREAS O DEPENDENCIAS"]
["3. ",{"$f":"'F2. COMP. LAB Y COM COMPOR'!B54","v":0},null,null,null,{"$f":"'F4. CALF. COM. COMPORT.'!N36","v":""}]
["4. ",{"$f":"'F2. COMP. LAB Y COM COMPOR'!B56","v":0},null,null,null,{"$f":"'F4. CALF. COM. COMPORT.'!N38","v":""},null,null,null,null,null,"CALIFICACIÓN",null,null,null,"NIVEL DE CALIFICACIÓN"]
["Totales Parciales Semestrales",null,null,null,null,{"$f":"'F4. CALF. COM. COMPORT.'!N41","v":0},null,null,null,null,null,{"$f":"(+F$57+S$47+P$50)","v":0},null,null,null,{"$f":"IF(AND(OR(SUM(P33:S42)>0,P44>1)=TRUE)=TRUE,IFERROR(VLOOKUP(L55,Hoja4!AA3:AB991,2),0),\"NO APLICA CALIFICACION\")","v":"NO APLICA CALIFICACION"}]
["Totales Parciales Semestrales con Eventuales",null,null,null,null,{"$f":"+'F8. EVA. EVENTUAL'!M59","v":0},null,null,null,null,null,"F2. COMP. LAB Y COM COMPOR'!A1"]
["CALIFICACIÓN DE LAS COMPETENCIAS COMPORTAMENTALES",null,null,null,null,{"$f":"(IF(F56=0,F55,F56))","v":0}]
["VIII. EVIDENCIAS, PLAN DE MEJORAMIENTO DEL EMPLEADO PÚBLICO Y REPORTES DE CALIFICACIÓN"]
["F3. EVIDENCIAS",null,null,"F7. PLAN DE MEJORAMIENTO",null,null,"F6. REPOR CLF PRD SEMESTRAL U ORD",null,null,"F8. EVA. EVENTUAL",null,null,"F9. EVA. EXTRAORDINARIA",null,null,null,"F11. EVA. INFERIOR AL SEMESTRE"]

{"sheet":"F2. COMP. LAB Y COM COMPOR","index":2,"n_rows":65,"n_cols":19,"rows_kept":65,"cut":false,"hidden":false,"merged":[[39,16,40,18],[41,16,42,18],[48,1,48,3],[48,4,48,10],[53,0,54,0],[51,0,52,0],[55,0,56,0],[49,0,50,0],[49,1,50,3],[53,4,54,10],[51,4,52,10],[49,4,50,10],[32,7,34,15],[35,7,36,15],[27,0,27,18],[28,0,29,4],[28,5,29,5],[28,6,29,9],[28,10,29,10],[28,11,29,12],[28,13,29,18],[32,0,34,6],[35,0,36,6],[31,0,31,18],[32,16,34,18],[35,16,36,18],[26,0,26,5],[26,6,26,12],[26,13,26,14],[26,15,26,16],[26,17,26,18],[24,15,24,18],[25,0,25,5],[25,13,25,14],[25,15,25,16],[25,17,25,18],[24,0,24,1],[24,2,24,4],[24,5,24,7],[24,8,24,10],[24,11,24,14],[23,0,23,1],[23,2,23,4],[23,5,23,7],[23,8,23,10],[23,11,23,14],[23,15,23,18],[20,15,20,16],[20,17,20,18],[21,0,21,5],[21,6,21,12],[21,13,21,14],[21,15,21,16],[21,17,21,18],[20,0,20,5],[20,13,20,14],[3,4,4,14],[5,4,6,6],[6,7,6,8],[6,9,6,10],[10,0,10,18],[14,8,14,18],[14,0,14,7],[11,0,11,1],[11,2,11,4],[11,5,11,7],[11,8,11,10],[11,11,11,14],[13,0,13,7],[11,15,11,18],[12,0,12,1],[12,2,12,4],[12,5,12,7],[12,8,12,10],[12,11,12,14],[12,15,12,18],[6,11,6,12],[0,0,0,18],[7,0,7,14],[8,0,9,3],[8,7,9,8],[8,12,9,15],[1,0,6,3],[1,4,2,14],[1,15,7,18],[63,12,64,18],[59,0,59,3],[58,10,59,11],[58,12,58,14],[59,12,59,14],[60,0,62,5],[60,6,62,11],[63,0,63,3],[63,4,63,5],[63,6,64,11],[64,0,64,3],[64,4,64,5],[58,7,58,9],[58,15,58,16],[59,4,59,6],[59,7,59,9],[16,0,16,4],[16,5,16,6],[15,0,15,4],[15,5,15,6],[18,8,18,10],[18,11,18,14],[18,15,18,18],[19,0,19,1],[58,0,58,3],[58,4,58,6],[45,0,45,10],[37,7,38,15],[39,7,40,15],[41,7,42,15],[43,7,44,15],[43,0,44,6],[45,11,45,18],[46,0,47,18],[57,0,57,18],[51,1,52,3],[53,1,54,3],[55,1,56,3],[48,11,48,18],[49,11,50,18],[58,17,58,18],[59,17,59,18],[60,12,62,18],[59,15,59,16],[17,0,17,18],[18,0,18,1],[18,2,18,4],[18,5,18,7],[30,0,30,18],[51,11,52,18],[53,11,54,18],[55,11,56,18],[55,4,56,10],[43,16,44,18],[37,0,38,6],[39,0,40,6],[41,0,42,6],[37,16,38,18],[19,2,19,4],[19,5,19,7],[19,8,19,10],[19,11,19,14],[19,15,19,18],[22,0,22,18],[15,8,16,8],[15,9,16,18],[13,8,13,18],[20,6,20,12],[25,6,25,12],[6,13,6,14],[5,7,5,8],[5,9,5,10],[5,11,5,12],[5,13,5,14]]}
[]
[null,null,null,null,"COMISIÓN NACIONAL DEL SERVICIO CIVIL"]
[]
[null,null,null,null,"FORMATO 2. COMPROMISOS LABORALES Y COMPETENCIAS COMPORTAMENTALES"]
[]
[null,null,null,null,"PROCESO: EVALUACIÓN DEL DESEMPEÑO LABORAL",null,null,"Código:  ",null,"F-ED-003",null,"Página",null,"1 de 1"]
[null,null,null,null,null,null,null,"Fecha de emisión: ",null,"2016-02-10",null,"Versión: ",null,"1.0"]
[]
["PERÍODO DE EVALUACIÓN",null,null,null,"DÍA","MES","AÑO","al",null,"DÍA","MES","AÑO","FECHA CONCERTACIÓN O AJUSTE DE COMPROMISOS",null,null,null,"DÍA","MES","AÑO"]
[]
["I. IDENTIFICACIÓN DEL EVALUADO"]
["Tipo de Documento",null,"Número de identificación",null,null,"Primer apellido",null,null,"Segundo apellido",null,null,"Primer nombre",null,null,null,"Otros nombres"]
["CÉDULA DE CIUDADANÍA",null,null,null,null,{"$f":"IF(C13=\"\",\"\",VLOOKUP(C13,Hoja4!BA2:BL578,2,0))","v":""},null,null,{"$f":"IF(C13=\"\",\"\",VLOOKUP(C13,Hoja4!BA2:BL578,3,0))","v":""},null,null,{"$f":"IF(C13=\"\",\"\",VLOOKUP(C13,Hoja4!BA2:BL578,4,0))","v":""},null,null,null,{"$f":"IF(C13=\"\",\"\",VLOOKUP(C13,Hoja4!BA2:BL578,5,0))","v":""}]
["Dependencia o área a la que pertenece el evaluado",null,null,null,null,null,null,null,"Denominación del empleo"]
[{"$f":"IF(C13=\"\",\"\",VLOOKUP(C13,Hoja4!BA2:BL578,8,0))","v":""},null,null,null,null,null,null,null,{"$f":"IF(C13=\"\",\"\",VLOOKUP(C13,Hoja4!BA2:BL578,9,0))","v":""}]
["Nivel jerárquico",null,null,null,null,"Código",null,"Grado","Propósito del empleo:"]
[{"$f":"IF(C13=\"\",\"\",VLOOKUP(C13,Hoja4!BA2:BL578,10,0))","v":""},null,null,null,null,{"$f":"IF(C13=\"\",\"\",VLOOKUP(C13,Hoja4!BA2:BL578,11,0))","v":""},null,{"$f":"IF(C13=\"\",\"\",VLOOKUP(C13,Hoja4!BA2:BL578,12,0))","v":""}]
["II. IDENTIFICACIÓN EVALUADOR. (Jefe inmediato)"]
["Tipo de documento",null,"Número de identificación",null,null,"Primer apellido",null,null,"Segundo apellido",null,null,"Primer nombre",null,null,null,"Otros nombres"]
["CEDULA DE CIUDADANIA",null,null,null,null,{"$f":"IF(C20=\"\",\"\",VLOOKUP(C20,Hoja4!BA2:BL578,2,0))","v":""},null,null,{"$f":"IF(C20=\"\",\"\",VLOOKUP(C20,Hoja4!BA2:BL578,3,0))","v":""},null,null,{"$f":"IF(C20=\"\",\"\",VLOOKUP(C20,Hoja4!BA2:BL578,4,0))","v":""},null,null,null,{"$f":"IF(C20=\"\",\"\",VLOOKUP(C20,Hoja4!BA2:BL578,5,0))","v":""}]
[" Área o Dependencia a la que pertenece el evaluador",null,null,null,null,null,"Denominación del empleo",null,null,null,null,null,null,"Código",null,"Grado",null,"Nivel jerárquico"]
[{"$f":"IF(C20=\"\",\"\",VLOOKUP(C20,Hoja4!BA2:BL578,8,0))","v":""},null,null,null,null,null,{"$f":"IF(C20=\"\",\"\",VLOOKUP(C20,Hoja4!BA2:BL578,9,0))","v":""},null,null,null,null,null,null,{"$f":"IF(C20=\"\",\"\",VLOOKUP(C20,Hoja4!BA2:BL578,11,0))","v":""},null,{"$f":"IF(C20=\"\",\"\",VLOOKUP(C20,Hoja4!BA2:BL578,12,0))","v":""},null,{"$f":"IF(C20=\"\",\"\",VLOOKUP(C13,Hoja4!BA2:BL578,10,0))","v":""}]
["III. IDENTIFICACIÓN EVALUADOR (Servidor público de Libre Nombramiento y Remoción en caso de constituir Comisión Evaluadora)"]
["Tipo de documento",null,"Número de identificación",null,null,"Primer apellido",null,null,"Segundo apellido",null,null,"Primer nombre",null,null,null,"Otros nombres"]
["CEDULA DE CIUDADANIA",null,null,null,null,{"$f":"IF(C25=\"\",\"\",VLOOKUP(C25,Hoja4!BA2:BL578,2,0))","v":""},null,null,{"$f":"IF(C25=\"\",\"\",VLOOKUP(C25,Hoja4!BA2:BL578,3,0))","v":""},null,null,{"$f":"IF(C25=\"\",\"\",VLOOKUP(C25,Hoja4!BA2:BL578,4,0))","v":""},null,null,null,{"$f":"IF(C25=\"\",\"\",VLOOKUP(C25,Hoja4!BA2:BL578,5,0))","v":""}]
["Dependencia o área a la que pertenece el evaluador",null,null,null,null,null,"Denominación del empleo",null,null,null,null,null,null,"Código",null,"Grado",null,"Nivel jerárquico"]
[{"$f":"IF(C25=\"\",\"\",VLOOKUP(C25,Hoja4!BA2:BL578,8,0))","v":""},null,null,null,null,null,{"$f":"IF(C25=\"\",\"\",VLOOKUP(C25,Hoja4!BA2:BL578,9,0))","v":""},null,null,null,null,null,null,{"$f":"IF(C25=\"\",\"\",VLOOKUP(C25,Hoja4!BA2:BL578,11,0))","v":""},null,{"$f":"IF(C25=\"\",\"\",VLOOKUP(C25,Hoja4!BA2:BL578,12,0))","v":""},null,{"$f":"IF(C25=\"\",\"\",VLOOKUP(C13,Hoja4!BA2:BL578,10,0))","v":""}]
[]
["CONCERTACIÓN DE COMPROMISOS",null,null,null,null,null,"AJUSTE DE COMPROMISOS",null,null,null,null,"SELECCIONE LA RAZÓN DEL AJUSTE DE LOS COMPROMISOS"]
[]
["IV. CONCERTACIÓN DE COMPROMISOS LABORALES Y COMPETENCIAS COMPORTAMENTALES."]
["COMPROMISOS LABORALES"]
["Metas de la Dependencia a las cuales contribuye el empleo",null,null,null,null,null,null,"Compromisos Laborales.",null,null,null,null,null,null,null,null,"Peso porcentual del compromiso"]
[]
[]
[]
[]
[]
[]
[]
[]
[]
[]
[]
[]
[" PESO TOTAL PONDERADO DE LOS COMPROMISOS",null,null,null,null,null,null,null,null,null,null,{"$f":"IF(SUM(Q36:S45)>1,CONCATENATE(\"ERROR!!: Sumatoria mayor a 100% (\",TEXT(SUM(Q36:S45),\"0%)\")),IF(SUM(Q36:S45)<1,CONCATENATE(\"ERROR!!: Sumatoria menor a 100% (\",TEXT(SUM(Q36:S45),\"0%)\")),SUM(Q36:S45)))","v":"ERROR!!: Sumatoria menor a 100% (0%)"}]
["V. FIJACIÓN DE COMPETENCIAS COMPORTAMENTALES"]
[]
["N°","COMPETENCIA",null,null,"DEFINICIÓN ",null,null,null,null,null,null,"CONDUCTAS ASOCIADAS"]
["1.  ",null,null,null,{"$f":"VLOOKUP(B50,Hoja4!A$220:C$242,2,FALSE)","v":{"$error":"#N/A"}},null,null,null,null,null,null,{"$f":"VLOOKUP(B50,Hoja4!A$220:C$242,3,FALSE)","v":{"$error":"#N/A"}}]
[]
["2. ",null,null,null,{"$f":"VLOOKUP(B52,Hoja4!A$220:C$242,2,FALSE)","v":{"$error":"#N/A"}},null,null,null,null,null,null,{"$f":"VLOOKUP(B52,Hoja4!A$220:C$242,3,FALSE)","v":{"$error":"#N/A"}}]
[]
["3. ",null,null,null,{"$f":"VLOOKUP(B54,Hoja4!A$220:C$242,2,FALSE)","v":{"$error":"#N/A"}},null,null,null,null,null,null,{"$f":"VLOOKUP(B54,Hoja4!A$220:C$242,3,FALSE)","v":{"$error":"#N/A"}}]
[]
["4. ",null,null,null,{"$f":"VLOOKUP(B56,Hoja4!A$220:C$242,2,FALSE)","v":{"$error":"#N/A"}},null,null,null,null,null,null,{"$f":"VLOOKUP(B56,Hoja4!A$220:C$242,3,FALSE)","v":{"$error":"#N/A"}}]
[]
["VI. FIRMAS, RECLAMACIÓN U OBJECIÓN."]
["FIRMA DEL EVALUADO",null,null,null,"FIRMA DEL JEFE INMEDIATO",null,null,"FIRMA DEL FUNCIONARIO DE LIBRE NOMBRAMIENTO Y REMOCIÓN ",null,null,"Renuencia del Evaluado para firmar la fijación de compromisos",null,"NOMBRE DEL TESTIGO",null,null,"FIRMA DEL TESTIGO",null,"FECHA"]
[]
["RECLAMACIÓN U OBJECIÓN EN ÚNICA INSTANCIA ANTE LA COMISIÓN DE PERSONAL (Parágrafo del articulo 22º, del Acuerdo 565 de 2016)",null,null,null,null,null,"DECISIÓN DE LA COMISIÓN DE PERSONAL",null,null,null,null,null,"MOTIVACIÓN DE LA DECISIÓN"]
[]
[]
["Número de Radicado"]
["Fecha Reclamación (dd/mm/aa)"]

{"sheet":"Hoja4","index":3,"n_rows":1188,"n_cols":64,"rows_kept":1188,"cut":false,"hidden":true,"merged":[[106,25,131,25],[28,25,53,25],[54,25,79,25],[80,25,105,25],[132,25,157,25],[446,8,446,9],[447,8,447,9],[158,25,183,25],[184,25,209,25],[210,25,236,25],[237,25,262,25],[446,10,446,11],[444,10,444,11],[445,10,445,11],[444,8,444,9],[445,8,445,9],[442,10,442,11],[443,10,443,11],[442,8,442,9],[443,8,443,9],[448,10,448,11],[449,10,449,11],[448,8,448,9],[449,8,449,9],[447,10,447,11],[17,17,18,17],[19,17,21,17],[22,17,24,17],[439,7,441,7],[439,10,441,11],[439,8,441,9]]}
[null,null,null,null,null,null,null,null,null,null,null,null,null,0,null,null,null,null,null,null,null,null,null,null,null,null,null,null,null,null,null,null,null,null,null,null,null,null,null,null,null,null,null,null,null,null,null,null,null,null,null,null,"Cédula","Primer Apellido","Segundo Apellido","Primer Nombre","Otros Nombres","Dependencia","Grupo","Dependencia o área a la que pertenece el evaluado","Denominación","Nivel Jerárquico","Código","Grado"]
["CODIGO",null,"DIRECTIVO","REVOCA",null,null,null,null,null,null,null,null,null,1,null,"2016-01-01",null,null,"SI",0.01,"NO SATISFACTORIO",null,null,null,null,"UNO",null,null,null,null,null,null,null,null,null,null,null,null,null,null,null,null,null,null,null,null,null,null,null,null,null,null,46453712,"ACERO","MONTAÑA","YOLIMA"," -","Dirección Administrativa","- Grupo de Trabajo de Contratación",{"$f":"CONCATENATE(BF2,\" \",BG2)","v":"Dirección Administrativa - Grupo de Trabajo de Contratación"},"Profesional Universitario (Prov)","PROFESIONAL",2044,11]
[1050,null,"ASESOR","MODIFICA",1,6,null,1,null,2016,null,65,null,2,null,"2016-01-02",null,null,"NO",0.02,"NO SATISFACTORIO",null,null,null,"CEDULA DE CIUDADANIA","UNO",1,"NO SATISFACTORIO",null,null,null,null,null,null,null,null,null,null,null,null,null,null,null,null,null,null,null,null,null,null,null,null,42064560,"ACEVEDO","ARIAS","MARTA","LUCÍA","Oficina de Servicios al Consumidor y de Apoyo Empresarial","- Grupo de Trabajo de Formación",{"$f":"CONCATENATE(BF3,\" \",BG3)","v":"Oficina de Servicios al Consumidor y de Apoyo Empresarial - Grupo de Trabajo de Formación"},"Profesional Universitario (Prov)","PROFESIONAL",2044,11]
[1020,null,"PROFESIONAL","CONFIRMA",2,9,"X",2,null,2017,null,76,null,3,null,"2016-01-03",null,null,null,0.03,"NO SATISFACTORIO",null,null,null,null,"UNO",1.1000000000000001,"NO SATISFACTORIO",null,null,null,null,null,null,null,null,null,null,null,null,null,null,null,null,null,null,null,null,null,null,null,null,52094312,"ACHURY","ESPITIA","NERY"," -","Dirección de Investigaciones de Protección de Usuarios de Servicios de Comunicaciones","- Grupo de Trabajo de Investigaciones Administrativas de Protección de Usuarios de Servicios de Comunicaciones","Dirección de Investigaciones de Protección de Usuarios de Servicios de Comunicaciones - Grupo de Trabajo de Investigaciones Administrativas de Protección de Usuarios de Servicios de Comunicaciones","Técnico Administrativo (Prov)","TECNICO",3124,"07"]
[1060,null,"TECNICO",null,3,12,null,3,null,2018,null,null,null,4,null,"2016-01-04",null,null,null,0.04,"NO SATISFACTORIO",null,null,null,null,"UNO",1.2,"NO SATISFACTORIO",null,null,null,null,null,null,null,null,null,null,null,null,null,null,null,null,null,null,null,null,null,null,null,null,19442933,"ACOSTA","MARRUGO","JOSÉ","RICARDO","Dirección de Investigaciones de Protección al Consumidor","- Grupo de Trabajo de Supervisión Empresarial y Seguridad de Producto","Dirección de Investigaciones de Protección al Consumidor - Grupo de Trabajo de Supervisión Empresarial y Seguridad de Producto","Profesional Universitario (E)","PROFESIONAL",2044,11]
[1045,null,"ASISTENCIAL",null,4,15,null,4,null,2019,null,null,null,5,null,"2016-01-05",null,null,null,0.05,"NO SATISFACTORIO",null,null,null,null,"UNO",1.3,"NO SATISFACTORIO",null,null,null,null,null,null,null,null,null,null,null,null,null,null,null,null,null,null,null,null,null,null,null,null,37535201,"ACUÑA","PORRAS","ANGELICA","MARIA","Secretaría General",null,"Secretaría General ","Secretario General","DIRECTIVO","0037",19]
[2025,null,null,null,5,4,null,5,null,2020,null,null,null,6,null,"2016-01-06",null,null,null,0.06,"NO SATISFACTORIO",null,null,null,null,"UNO",1.4,"NO SATISFACTORIO",null,null,null,null,null,null,null,null,null,null,null,null,null,null,null,null,null,null,null,null,null,null,null,null,79323502,"ADARME","RODRÍGUEZ","JUAN","CARLOS","Despacho del Superintendente Delegado para la Propiedad Industrial","- Grupo de Trabajo de Centro de Información Tecnológica y Apoyo a la Gestión de la Propiedad Industrial","Despacho del Superintendente Delegado para la Propiedad Industrial - Grupo de Trabajo de Centro de Información Tecnológica y Apoyo a la Gestión de la Propiedad Industrial","Profesional Universitario (Prov)","PROFESIONAL",2044,"09"]
[2001,null,null,null,6,6,null,6,null,2021,null,null,null,7,null,"2016-01-07",null,null,null,7.0000000000000007E-2,"NO SATISFACTORIO",null,null,null,"EVALUADO","UNO",1.5,"NO SATISFACTORIO",null,null,null,null,null,null,null,null,null,null,null,null,null,null,null,null,null,null,null,null,null,null,null,null,64544479,"AGAMEZ","ORDOÑEZ","LUDIS","ELVIRA","Dirección Administrativa","- Grupo de Trabajo de Gestión Documental y Recursos Físicos","Dirección Administrativa - Grupo de Trabajo de Gestión Documental y Recursos Físicos","Profesional Universitario (E)","PROFESIONAL",2044,"05"]
[2132,null,"CEDULA DE CIUDADANIA",null,7,8,null,7,null,2022,null,null,null,8,null,"2016-01-08",null,null,null,0.08,"NO SATISFACTORIO",null,null,null,"EVALUADOR","UNO",1.6,"NO SATISFACTORIO",null,null,null,null,null,null,null,null,null,null,null,null,null,null,null,null,null,null,null,null,null,null,null,null,52842744,"AGUDELO","BASTILLA","GINA","PAOLA","Oficina de Servicios al Consumidor y de Apoyo Empresarial","","Oficina de Servicios al Consumidor y de Apoyo Empresarial ","Profesional Especializado (Prov)","PROFESIONAL",2028,13]
[2133,null,"CEDULA DE EXTRAJERIA",null,8,10,null,8,null,2023,null,null,null,9,null,"2016-01-09",null,null,null,0.09,"NO SATISFACTORIO",1,1,null,"TERCERO","UNO",1.7,"NO SATISFACTORIO",null,null,null,null,null,null,null,null,null,null,null,null,null,null,null,null,null,null,null,null,null,null,null,null,46383267,"AGUDELO","GUIO","YURANY","ANDREA","Despacho del Superintendente Delegado para Asuntos Jurisdiccionales","- Grupo de Trabajo de Calificación","Despacho del Superintendente Delegado para Asuntos Jurisdiccionales - Grupo de Trabajo de Calificación","Profesional Universitario (Prov)","PROFESIONAL",2044,11]
[2002,null,null,null,9,null,null,9,null,2024,null,null,null,10,null,"2016-01-10",null,null,null,0.1,"NO SATISFACTORIO",2,2,null,null,"UNO",1.8,"NO SATISFACTORIO",null,null,null,null,null,null,null,null,null,null,null,null,null,null,null,null,null,null,null,null,null,null,null,null,80239897,"AGUIRRE","ROMERO","ELVIS"," -","Dirección de Investigaciones para el Control y Verificación de Reglamentos Técnicos y Metrología Legal","- Grupo de Trabajo de Inspección y Vigilancia de Metrología Legal","Dirección de Investigaciones para el Control y Verificación de Reglamentos Técnicos y Metrología Legal - Grupo de Trabajo de Inspección y Vigilancia de Metrología Legal","Técnico Administrativo (Prov)","TECNICO",3124,11]
[2125,null,null,null,10,null,null,10,null,2025,null,null,null,11,null,"2016-01-11",null,null,null,0.11,"NO SATISFACTORIO",3,3,null,null,"UNO",1.9,"NO SATISFACTORIO",null,null,null,null,null,null,null,null,null,null,null,null,null,null,null,null,null,null,null,null,null,null,null,null,51810532,"ALARCÓN","CASTRO","EDNA","PATRICIA","Dirección de Nuevas Creaciones","- Grupo de Trabajo de Ciencias Químicas","Dirección de Nuevas Creaciones - Grupo de Trabajo de Ciencias Químicas","Profesional Universitario (Prov)","PROFESIONAL",2044,"01"]
[2137,null,null,null,11,null,null,11,null,2026,null,null,null,12,null,"2016-01-12",null,null,null,0.12,"NO SATISFACTORIO",4,4,null,null,"UNO",2,"NO SATISFACTORIO",null,null,null,null,null,null,null,null,null,null,null,null,null,null,null,null,null,null,null,null,null,null,null,null,51985950,"ALFONSO","ROZO","GLORIA","JACQUELINE","Despacho del Superintendente Delegado para la Propiedad Industrial","- Grupo de Trabajo de Vía Gubernativa","Despacho del Superintendente Delegado para la Propiedad Industrial - Grupo de Trabajo de Vía Gubernativa","Profesional Universitario (Prov)","PROFESIONAL",2044,"09"]
[2012,null,null,null,12,null,null,12,null,2027,null,null,null,13,null,"2016-01-13",null,null,null,0.13,"NO SATISFACTORIO",null,5,null,null,"UNO",2.1,"NO SATISFACTORIO",null,null,null,null,null,null,null,null,null,null,null,null,null,null,null,null,null,null,null,null,null,null,null,null,35354033,"ALGARRA","GARZÓN","DIANA","YADIRA","Secretaría General","- Grupo de Trabajo de Notificaciones y Certificaciones","Secretaría General - Grupo de Trabajo de Notificaciones y Certificaciones","Técnico Administrativo (Prov)","TECNICO",3124,11]
[2014,null,null,null,13,null,null,13,null,2028,null,null,null,14,null,"2016-01-14",null,null,null,0.14000000000000001,"NO SATISFACTORIO",null,6,null,null,"UNO",2.2000000000000002,"NO SATISFACTORIO",null,null,null,null,null,null,null,null,null,null,null,null,null,null,null,null,null,null,null,null,null,null,null,null,52264031,"ÁLVAREZ","ORTEGA","DAYANA","PAOLA","Despacho del Superintendente Delegado para la Protección de la Competencia","- Grupo de Trabajo Interdisciplinario de Colusiones","Despacho del Superintendente Delegado para la Protección de la Competencia - Grupo de Trabajo Interdisciplinario de Colusiones","Técnico Administrativo (E)","TECNICO",3124,11]
[2018,null,null,null,14,null,null,14,null,2029,null,null,null,15,null,"2016-01-15",null,null,null,0.15,"NO SATISFACTORIO",null,7,null,null,"UNO",2.2999999999999998,"NO SATISFACTORIO",null,null,null,null,null,null,null,null,null,null,null,null,null,null,null,null,null,null,null,null,null,null,null,null,24828553,"ALZATE","RÍOS","CLAUDIA","YANETH","Dirección de Nuevas Creaciones",null,"Dirección de Nuevas Creaciones ","Profesional Universitario (Prov)","PROFESIONAL",2044,"01"]
[2003,null,null,null,15,null,null,15,null,2030,null,null,null,16,null,"2016-01-16",null,null,null,0.16,null,null,8,null,null,"UNO",15,"NO SATISFACTORIO",null,null,null,null,null,null,null,null,null,null,null,null,null,null,null,null,null,null,null,null,null,null,null,null,24829422,"ALZATE","RÍOS","MARÍA","DEL PILAR","Oficina Asesora Jurídica",null,"Oficina Asesora Jurídica ","Secretario (Prov)","ASISTENCIAL",4178,11]
[2004,null,null,null,16,null,null,16,null,2031,null,null,null,17,null,"2016-01-17",null,"CONOCIMIENTO DEL ENTORNO",null,0.16,"NO SATISFACTORIO",5,9,null,null,"UNO",2.4,"NO SATISFACTORIO",null,null,null,null,null,null,null,null,null,null,null,null,null,null,null,null,null,null,null,null,null,null,null,null,79377839,"AQUITE","RUÍZ","JOSÉ","OCTAVIO","Secretaría General","","Secretaría General ","Conductor Mecánico (E)","ASISTENCIAL",4103,11]
[2085,null,null,null,17,null,null,17,null,2032,null,null,null,18,null,"2016-01-18",null,null,null,0.17,"NO SATISFACTORIO",5.9589041095890396,10,null,null,"UNO",2.5,"NO SATISFACTORIO",null,null,null,null,null,null,null,null,null,null,null,null,null,null,null,null,null,null,null,null,null,null,null,null,1013641362,"ARANGUREN","URREGO","LIZEHIDY"," -","Dirección de Investigación de Protección de Datos Personales","- Grupo de Trabajo de Investigaciones Administrativas de Protección de Datos Personales","Dirección de Investigación de Protección de Datos Personales - Grupo de Trabajo de Investigaciones Administrativas de Protección de Datos Personales","Auxiliar Administrativo (Prov)","ASISTENCIAL",4044,"08"]
[2120,null,null,null,18,null,null,18,null,2033,null,null,null,19,null,"2016-01-19",null,"CONSTRUCCIÓN DE RELACIONES",null,0.18,"NO SATISFACTORIO",6.5068493150685001,11,null,null,"UNO",2.6,"NO SATISFACTORIO",null,null,null,null,null,null,null,null,null,null,null,null,null,null,null,null,null,null,null,null,null,null,null,null,37827851,"ARDILA","CARRILLO","CARMEN","JUDITH","Dirección de Investigación de Protección de Datos Personales",null,"Dirección de Investigación de Protección de Datos Personales ","Secretario (Prov)","ASISTENCIAL",4178,11]
[2142,null,null,null,19,null,null,19,null,2034,null,null,null,20,null,"2016-01-20",null,null,null,0.19,"NO SATISFACTORIO",7.0547945205479401,12,null,null,"UNO",2.7,"NO SATISFACTORIO",null,null,null,null,null,null,null,null,null,null,null,null,null,null,null,null,null,null,null,null,null,null,null,null,80171092,"ARÉVALO","MORALES","HÉCTOR","DANIEL","Dirección de Investigaciones para el Control y Verificación de Reglamentos Técnicos y Metrología Legal","","Dirección de Investigaciones para el Control y Verificación de Reglamentos Técnicos y Metrología Legal ","Profesional Universitario (Prov)","PROFESIONAL",2044,"01"]
[2087,null,null,null,20,null,null,20,null,2035,null,null,null,21,null,"2016-01-21",null,null,null,0.2,"NO SATISFACTORIO",7.6027397260273899,13,null,null,"UNO",2.8,"NO SATISFACTORIO",null,null,null,null,null,null,null,null,null,null,null,null,null,null,null,null,null,null,null,null,null,null,null,null,79106103,"ARÉVALO","PÓRRAS","HÉCTOR"," -","Dirección Administrativa","- Grupo de Trabajo de Gestión Documental y Recursos Físicos","Dirección Administrativa - Grupo de Trabajo de Gestión Documental y Recursos Físicos","Técnico Administrativo (E)","TECNICO",3124,11]
[2123,null,null,null,21,null,null,21,null,2036,null,null,null,22,null,"2016-01-22",null,"INICIATIVA",null,0.21,"NO SATISFACTORIO",8.1506849315068504,14,null,null,"UNO",2.9,"NO SATISFACTORIO",null,null,null,null,null,null,null,null,null,null,null,null,null,null,null,null,null,null,null,null,null,null,null,null,52071397,"ARIAS","FAJARDO","YOLANDA"," -","Despacho del Superintendente Delegado para la Propiedad Industrial","- Grupo de Trabajo de Vía Gubernativa","Despacho del Superintendente Delegado para la Propiedad Industrial - Grupo de Trabajo de Vía Gubernativa","Profesional Universitario (Prov)","PROFESIONAL",2044,11]
[2052,null,null,null,22,null,null,22,null,2037,null,null,null,23,null,"2016-01-23",null,null,null,0.22,"NO SATISFACTORIO",8.6986301369862993,15,null,null,"UNO",3,"NO SATISFACTORIO",null,null,null,null,null,null,null,null,null,null,null,null,null,null,null,null,null,null,null,null,null,null,null,null,77031855,"ARIAS","FLÓREZ","RICARDO"," -","Despacho del Superintendente Delegado para Asuntos Jurisdiccionales","- Grupo de Trabajo de Defensa del Consumidor","Despacho del Superintendente Delegado para Asuntos Jurisdiccionales - Grupo de Trabajo de Defensa del Consumidor","Profesional Universitario (Prov)","PROFESIONAL",2044,"05"]
[2009,null,null,null,23,null,null,23,null,2038,null,null,null,24,null,"2016-01-24",null,null,null,0.23,"NO SATISFACTORIO",9.24657534246575,16,null,null,"UNO",3.1,"NO SATISFACTORIO",null,null,null,null,null,null,null,null,null,null,null,null,null,null,null,null,null,null,null,null,null,null,null,null,79963337,"ARIAS","MONTEALEGRE","ALEJANDRO"," -","Despacho del Superintendente Delegado para la Protección de la Competencia",null,"Despacho del Superintendente Delegado para la Protección de la Competencia ","Técnico Administrativo (Prov)","TECNICO",3124,11]
[2007,null,null,null,24,null,null,24,null,2039,null,65,null,25,null,"2016-01-25",null,null,null,0.24,"NO SATISFACTORIO",9.7945205479452007,17,null,null,"UNO",3.2,"NO SATISFACTORIO",null,null,null,null,null,null,null,null,null,null,null,null,null,null,null,null,null,null,null,null,null,null,null,null,1118807637,"ARIZA","MOSCOTE","ADRIANA","CRISTINA","Dirección de Signos Distintivos","- Grupo de Trabajo de Fondo","Dirección de Signos Distintivos - Grupo de Trabajo de Fondo","Profesional Universitario (Prov)","PROFESIONAL",2044,"01"]
[2112,null,null,null,25,null,null,25,null,2040,null,76,null,26,null,"2016-01-26",null,null,null,0.25,"NO SATISFACTORIO",10.342465753424699,18,null,null,"UNO",3.3,"NO SATISFACTORIO",null,null,null,null,null,null,null,null,null,null,null,null,null,null,null,null,null,null,null,null,null,null,null,null,52431736,"AROCA","ALARCON","ADONIA","CECILIA","Oficina Asesora Jurídica",null,"Oficina Asesora Jurídica ","Profesional Universitario (Prov)","PROFESIONAL",2044,"07"]
[2165,null,null,null,26,null,null,26,null,2042,null,80,null,27,null,"2016-01-27",null,null,null,0.26,"NO SATISFACTORIO",10.8904109589041,19,null,null,"UNO",3.3,"NO SATISFACTORIO",null,null,null,null,null,null,null,null,null,null,null,null,null,null,null,null,null,null,null,null,null,null,null,null,1020757553,"ARTETA","LLANOS","ALEJANDRA"," -","Dirección de Signos Distintivos",null,"Dirección de Signos Distintivos ","Profesional Universitario (Prov)","PROFESIONAL",2044,"01"]
[2028,null,null,null,27,null,null,27,null,2043,null,85,null,28,null,"2016-01-28",null,null,null,0.27,"NO SATISFACTORIO",11.438356164383601,20,null,null,"DOS",3.4,"NO SATISFACTORIO",null,null,null,null,null,null,null,null,null,null,null,null,null,null,null,null,null,null,null,null,null,null,null,null,79811967,"ASPRILLA","CRUZ","OSCAR","JAVIER","Oficina de Tecnología e Informática",null,"Oficina de Tecnología e Informática ","Jefe de Oficina","DIRECTIVO","0137",16]
[2033,null,null,null,null,null,null,28,null,2044,null,90,null,29,null,"2016-01-29",null,null,null,0.28000000000000003,"NO SATISFACTORIO",11.986301369863,21,null,null,null,3.5,"NO SATISFACTORIO",null,null,null,null,null,null,null,null,null,null,null,null,null,null,null,null,null,null,null,null,null,null,null,null,52712993,"AVENDAÑO","DICELIS","NICOLE","YVETTE","Despacho del Superintendente Delegado para el Control y Verificación de Reglamentos Técnicos y Metrología Legal","","Despacho del Superintendente Delegado para el Control y Verificación de Reglamentos Técnicos y Metrología Legal ","Asesor","ASESOR",1020,"05"]
[2044,null,null,null,null,null,null,29,null,2045,null,95,null,30,null,"2016-01-30",null,null,null,0.28999999999999998,"NO SATISFACTORIO",12.534246575342401,22,null,null,null,3.6,"NO SATISFACTORIO",null,null,null,null,null,null,null,null,null,null,null,null,null,null,null,null,null,null,null,null,null,null,null,null,65631743,"AVENDAÑO","RUBIO","LADY","MARIANA","Despacho del Superintendente Delegado para la Protección del Consumidor","","Despacho del Superintendente Delegado para la Protección del Consumidor ","Profesional Universitario (Prov)","PROFESIONAL",2044,11]
[2048,null,null,null,null,null,null,30,null,2046,null,100,null,31,null,"2016-01-31",null,null,null,0.3,"NO SATISFACTORIO",13.082191780821899,23,null,null,null,3.7,"NO SATISFACTORIO",null,null,null,null,null,null,null,null,null,null,null,null,null,null,null,null,null,null,null,null,null,null,null,null,79907002,"ÁVILA","MUÑOZ","MARIO","FERNANDO","Despacho del Superintendente Delegado para Asuntos Jurisdiccionales","- Grupo de Trabajo de Secretaría","Despacho del Superintendente Delegado para Asuntos Jurisdiccionales - Grupo de Trabajo de Secretaría","Auxiliar Administrativo (Prov)","ASISTENCIAL",4044,"09"]
[2152,null,null,null,null,null,null,31,null,2047,null,null,null,32,null,"2016-02-01",null,null,null,0.31,"NO SATISFACTORIO",13.6301369863013,24,null,null,null,3.8,"NO SATISFACTORIO",null,null,null,null,null,null,null,null,null,null,null,null,null,null,null,null,null,null,null,null,null,null,null,null,1015411723,"AYALA","RAMÍREZ","CAMILO","ENRIQUE","Dirección de Investigaciones de Protección de Usuarios de Servicios de Comunicaciones","- Grupo de Trabajo de Investigaciones Administrativas de Protección de Usuarios de Servicios de Comunicaciones","Dirección de Investigaciones de Protección de Usuarios de Servicios de Comunicaciones - Grupo de Trabajo de Investigaciones Administrativas de Protección de Usuarios de Servicios de Comunicaciones","Profesional Universitario (Prov)","PROFESIONAL",2044,"07"]
[2184,null,null,null,null,null,null,null,null,2048,null,null,null,33,null,"2016-02-02",null,null,null,0.32,"NO SATISFACTORIO",14.178082191780801,25,null,null,null,3.9,"NO SATISFACTORIO",null,null,null,null,null,null,null,null,null,null,null,null,null,null,null,null,null,null,null,null,null,null,null,null,1032396275,"BÁEZ","JIMÉNEZ","DIANA","CAROLINA","Despacho del Superintendente Delegado para la Protección del Consumidor","","Despacho del Superintendente Delegado para la Protección del Consumidor ","Profesional Universitario (Prov)","PROFESIONAL",2044,"09"]
[2094,null,null,null,null,null,null,null,null,2049,null,null,null,34,null,"2016-02-03",null,null,null,0.33,"NO SATISFACTORIO",14.7260273972603,26,null,null,null,4,"NO SATISFACTORIO",null,null,null,null,null,null,null,null,null,null,null,null,null,null,null,null,null,null,null,null,null,null,null,null,11426455,"BAJONERO","PÁEZ","CELIO","ENRIQUE","Oficina de Control Interno",null,"Oficina de Control Interno ","Profesional Universitario (E)","PROFESIONAL",2044,"09"]
[2186,null,null,null,null,null,null,null,null,2050,null,null,null,35,null,"2016-02-04",null,null,null,0.34,"NO SATISFACTORIO",15.2739726027397,27,null,null,null,4.0999999999999996,"NO SATISFACTORIO",null,null,null,null,null,null,null,null,null,null,null,null,null,null,null,null,null,null,null,null,null,null,null,null,17315621,"BALLÉN","MEDINA","NELSON","OSBALDO","Dirección de Investigación de Protección de Datos Personales","- Grupo de Trabajo de Habeas Data","Dirección de Investigación de Protección de Datos Personales - Grupo de Trabajo de Habeas Data","Profesional Universitario (E)","PROFESIONAL",2044,11]
[2102,null,null,null,null,null,null,null,null,null,null,null,null,36,null,"2016-02-05",null,null,null,0.35,"NO SATISFACTORIO",15.821917808219199,28,null,null,null,4.2,"NO SATISFACTORIO",null,null,null,null,null,null,null,null,null,null,null,null,null,null,null,null,null,null,null,null,null,null,null,null,4343607,"BALLESTEROS","ARRUBLA","JOSÉ","GUILLERMO","Despacho del Superintendente ","- Grupo de Trabajo de Apoyo a la Red Nacional de Protección al Consumidor","Despacho del Superintendente  - Grupo de Trabajo de Apoyo a la Red Nacional de Protección al Consumidor","Técnico Administrativo (E)","TECNICO",3124,11]
[2103,null,null,null,null,null,null,null,null,null,null,null,null,37,null,"2016-02-06",null,null,null,0.36,"NO SATISFACTORIO",16.369863013698598,29,null,null,null,4.3,"NO SATISFACTORIO",null,null,null,null,null,null,null,null,null,null,null,null,null,null,null,null,null,null,null,null,null,null,null,null,51940634,"BARRERA","ARIZA","MARÍA","DEL PILAR","Dirección Financiera",null,"Dirección Financiera ","Profesional Universitario (Prov)","PROFESIONAL",2044,"09"]
[2114,null,null,null,null,null,null,null,null,null,null,null,null,38,null,"2016-02-07",null,null,null,0.37,"NO SATISFACTORIO",16.917808219178099,30,null,null,null,4.4000000000000004,"NO SATISFACTORIO",null,null,null,null,null,null,null,null,null,null,null,null,null,null,null,null,null,null,null,null,null,null,null,null,51776133,"BARRERA","GARZÓN","CLARA","INÉS","Dirección de Nuevas Creaciones","","Dirección de Nuevas Creaciones ","Profesional Universitario (E)","PROFESIONAL",2044,11]
[2147,null,null,null,null,null,null,null,null,null,null,null,null,39,null,"2016-02-08",null,null,null,0.38,"NO SATISFACTORIO",17.4657534246575,31,null,null,null,4.5,"NO SATISFACTORIO",null,null,null,null,null,null,null,null,null,null,null,null,null,null,null,null,null,null,null,null,null,null,null,null,80234496,"BARRERA","MONTERROSA","RAFAEL"," -","Dirección de Signos Distintivos","- Grupo de Trabajo de Registro","Dirección de Signos Distintivos - Grupo de Trabajo de Registro","Profesional Universitario (Prov)","PROFESIONAL",2044,"03"]
[2116,null,null,null,null,null,null,null,null,null,null,null,null,40,null,"2016-02-09",null,null,null,0.39,"NO SATISFACTORIO",18.013698630137,32,null,null,null,4.5999999999999996,"NO SATISFACTORIO",null,null,null,null,null,null,null,null,null,null,null,null,null,null,null,null,null,null,null,null,null,null,null,null,52965391,"BARRERO","BUSTAMANTE","JULIE","JOHANNA","Dirección de Nuevas Creaciones","- Grupo de Trabajo del Sector de Ingenierías","Dirección de Nuevas Creaciones - Grupo de Trabajo del Sector de Ingenierías","Profesional Universitario (Prov)","PROFESIONAL",2044,"03"]
[3003,null,null,null,null,null,null,null,null,null,null,null,null,41,null,"2016-02-10",null,null,null,0.4,"NO SATISFACTORIO",18.561643835616401,33,null,null,null,4.7,"NO SATISFACTORIO",null,null,null,null,null,null,null,null,null,null,null,null,null,null,null,null,null,null,null,null,null,null,null,null,79879352,"BARRETO","DAZA","MARCELO"," -","Dirección Administrativa","- Grupo de Trabajo de Contratación","Dirección Administrativa - Grupo de Trabajo de Contratación","Profesional Universitario (Prov)","PROFESIONAL",2044,11]
[3038,null,null,null,null,null,null,null,null,null,null,null,null,42,null,"2016-02-11",null,null,null,0.41,"NO SATISFACTORIO",19.109589041095902,34,null,null,null,4.8,"NO SATISFACTORIO",null,null,null,null,null,null,null,null,null,null,null,null,null,null,null,null,null,null,null,null,null,null,null,null,19459855,"BARRETO","GÓMEZ","CARLOS","ANTONIO","Despacho del Superintendente Delegado para la Protección de la Competencia","- Grupo de Trabajo Interdisciplinario de Colusiones","Despacho del Superintendente Delegado para la Protección de la Competencia - Grupo de Trabajo Interdisciplinario de Colusiones","Profesional Especializado (E)","PROFESIONAL",2028,13]
[3046,null,null,null,null,null,null,null,null,null,null,null,null,43,null,"2016-02-12",null,null,null,0.42,"NO SATISFACTORIO",19.657534246575299,35,null,null,null,4.9000000000000004,"NO SATISFACTORIO",null,null,null,null,null,null,null,null,null,null,null,null,null,null,null,null,null,null,null,null,null,null,null,null,79419161,"BARRETO","ROJAS","LUIS","HENRY","Dirección de Investigaciones para el Control y Verificación de Reglamentos Técnicos y Metrología Legal","- Grupo de Trabajo de Inspección y Vigilancia de Metrología Legal","Dirección de Investigaciones para el Control y Verificación de Reglamentos Técnicos y Metrología Legal - Grupo de Trabajo de Inspección y Vigilancia de Metrología Legal","Profesional Universitario (Prov)","PROFESIONAL",2044,"09"]
[3054,null,null,null,null,null,null,null,null,null,null,null,null,44,null,"2016-02-13",null,null,null,0.43,"NO SATISFACTORIO",20.205479452054799,36,null,null,null,5,"NO SATISFACTORIO",null,null,null,null,null,null,null,null,null,null,null,null,null,null,null,null,null,null,null,null,null,null,null,null,28551411,"BAUTISTA","RODRIGUEZ","EDNA","MILENA","Despacho del Superintendente Delegado para la Propiedad Industrial","- Grupo de Trabajo de Centro de Información Tecnológica y Apoyo a la Gestión de la Propiedad Industrial","Despacho del Superintendente Delegado para la Propiedad Industrial - Grupo de Trabajo de Centro de Información Tecnológica y Apoyo a la Gestión de la Propiedad Industrial","Profesional Universitario (Prov)","PROFESIONAL",2044,"03"]
[3066,null,null,null,null,null,null,null,null,null,null,null,null,45,null,"2016-02-14",null,null,null,0.44,"NO SATISFACTORIO",20.7534246575342,37,null,null,null,5.0999999999999996,"NO SATISFACTORIO",null,null,null,null,null,null,null,null,null,null,null,null,null,null,null,null,null,null,null,null,null,null,null,null,52078777,"BECERRA","GARCÍA","YENNY","YAZMÍN","Oficina Asesora Jurídica",null,"Oficina Asesora Jurídica ","Secretario (Prov)","ASISTENCIAL",4178,11]
[3066,null,null,null,null,null,null,null,null,null,null,null,null,46,null,"2016-02-15",null,null,null,0.45,"NO SATISFACTORIO",21.301369863013701,38,null,null,null,5.6,"NO SATISFACTORIO",null,null,null,null,null,null,null,null,null,null,null,null,null,null,null,null,null,null,null,null,null,null,null,null,79639893,"BEDOYA","SILVA","FABIÁN","ANDRÉS","Dirección Administrativa","- Grupo de Trabajo de Gestión Documental y Recursos Físicos","Dirección Administrativa - Grupo de Trabajo de Gestión Documental y Recursos Físicos","Profesional Universitario (Prov)","PROFESIONAL",2044,"07"]
[3074,null,null,null,null,null,null,null,null,null,null,null,null,47,null,"2016-02-16",null,null,null,0.46,"NO SATISFACTORIO",21.849315068493102,39,null,null,null,5.7,"NO SATISFACTORIO",null,null,null,null,null,null,null,null,null,null,null,null,null,null,null,null,null,null,null,null,null,null,null,null,79970924,"BEJARANO","MORALES","FERNANDO"," -","Despacho del Superintendente Delegado para la Protección de la Competencia","- Grupo de Trabajo de Integraciones Empresariales","Despacho del Superintendente Delegado para la Protección de la Competencia - Grupo de Trabajo de Integraciones Empresariales","Profesional Universitario (Prov)","PROFESIONAL",2044,"03"]
[3078,null,null,null,null,null,null,null,null,null,null,null,null,48,null,"2016-02-17",null,null,null,0.47,"NO SATISFACTORIO",22.397260273972599,40,null,null,null,5.8,"NO SATISFACTORIO",null,null,null,null,null,null,null,null,null,null,null,null,null,null,null,null,null,null,null,null,null,null,null,null,80181720,"BELTRAN","PRADO","ISMAEL"," -","Despacho del Superintendente","- Grupo de Trabajo de Abogacía de la Competencia","Despacho del Superintendente - Grupo de Trabajo de Abogacía de la Competencia","Asesor","ASESOR",1020,"06"]
[3080,null,null,null,null,null,null,null,null,null,null,null,null,49,null,"2016-02-18",null,null,null,0.48,"NO SATISFACTORIO",22.945205479452,41,null,null,null,5.9,"NO SATISFACTORIO",null,null,null,null,null,null,null,null,null,null,null,null,null,null,null,null,null,null,null,null,null,null,null,null,80821457,"BELTRAN","ROJAS","LUIS","CARLOS","Oficina Asesora Jurídica","- Grupo de Trabajo de Gestión Judicial","Oficina Asesora Jurídica - Grupo de Trabajo de Gestión Judicial","Profesional Universitario (Prov)","PROFESIONAL",2044,"07"]
[3084,null,null,null,null,null,null,null,null,null,null,null,null,50,null,"2016-02-19",null,null,null,0.49,"NO SATISFACTORIO",23.4931506849315,42,null,null,null,6,"NO SATISFACTORIO",null,null,null,null,null,null,null,null,null,null,null,null,null,null,null,null,null,null,null,null,null,null,null,null,30336652,"BENAVIDES","SALAZAR","OLGA","XIMENA","Dirección de Nuevas Creaciones","- Grupo de Trabajo del Sector de Ingenierías","Dirección de Nuevas Creaciones - Grupo de Trabajo del Sector de Ingenierías","Profesional Universitario (Prov)","PROFESIONAL",2044,"01"]
[3092,null,null,null,null,null,null,null,null,null,null,null,null,51,null,"2016-02-20",null,null,null,0.5,"NO SATISFACTORIO",24.041095890410901,43,null,null,null,6.1,"NO SATISFACTORIO",null,null,null,null,null,null,null,null,null,null,null,null,null,null,null,null,null,null,null,null,null,null,null,null,1018403985,"BERMÚDEZ","BOHÓRQUEZ","SANDRA","NATALIA","Secretaría General","- Grupo de Trabajo de Notificaciones y Certificaciones","Secretaría General - Grupo de Trabajo de Notificaciones y Certificaciones","Profesional Universitario (Prov)","PROFESIONAL",2044,"03"]
[3094,null,null,null,null,null,null,null,null,null,null,null,null,52,null,"2016-02-21",null,null,null,0.51,"NO SATISFACTORIO",24.589041095890401,44,null,null,null,6.2,"NO SATISFACTORIO",null,null,null,null,null,null,null,null,null,null,null,null,null,null,null,null,null,null,null,null,null,null,null,null,52355918,"BERMÚDEZ","HUERTAS","ANDREA"," -","Despacho del Superintendente Delegado para la Propiedad Industrial","- Grupo de Trabajo de Centro de Información Tecnológica y Apoyo a la Gestión de la Propiedad Industrial","Despacho del Superintendente Delegado para la Propiedad Industrial - Grupo de Trabajo de Centro de Información Tecnológica y Apoyo a la Gestión de la Propiedad Industrial","Profesional Universitario (Prov)","PROFESIONAL",2044,"05"]
[3070,null,null,null,null,null,null,null,null,null,null,null,null,53,null,"2016-02-22",null,null,null,0.52,"NO SATISFACTORIO",null,45,null,null,null,6.3,"NO SATISFACTORIO",null,null,null,null,null,null,null,null,null,null,null,null,null,null,null,null,null,null,null,null,null,null,null,null,51585799,"BERNAL","CASTRO","JUDITH"," -","Oficina Asesora Jurídica","- Grupo de Trabajo de Gestión Judicial","Oficina Asesora Jurídica - Grupo de Trabajo de Gestión Judicial","Técnico Administrativo (E)","TECNICO",3124,11]
[3102,null,null,null,null,null,null,null,null,null,null,null,null,54,null,"2016-02-23",null,null,null,0.53,"NO SATISFACTORIO",null,46,null,null,"TRES",6.4,"NO SATISFACTORIO",null,null,null,null,null,null,null,null,null,null,null,null,null,null,null,null,null,null,null,null,null,null,null,null,51737682,"BERNAL","GALINDO","OLGA","ESPERANZA","Despacho del Superintendente","","Despacho del Superintendente ","Secretario Ejecutivo (En Comisión)","ASISTENCIAL",4210,18]
[3105,null,null,null,null,null,null,null,null,null,null,null,null,55,null,"2016-02-24",null,null,null,0.54,"NO SATISFACTORIO",null,47,null,null,null,6.5,"NO SATISFACTORIO",null,null,null,null,null,null,null,null,null,null,null,null,null,null,null,null,null,null,null,null,null,null,null,null,80157448,"BERNAL","PARRA","RODRIGO","ALFONSO","Secretaría General","- Grupo de Trabajo de Talento Humano","Secretaría General - Grupo de Trabajo de Talento Humano","Profesional Universitario (Prov)","PROFESIONAL",2044,10]
[3110,null,null,null,null,null,null,null,null,null,null,null,null,56,null,"2016-02-25",null,null,null,0.55000000000000004,"NO SATISFACTORIO",null,48,null,null,null,6.6,"NO SATISFACTORIO",null,null,null,null,null,null,null,null,null,null,null,null,null,null,null,null,null,null,null,null,null,null,null,null,52733552,"BERNAL","QUIJANO","DIANA","CAROLINA","Dirección de Signos Distintivos","","Dirección de Signos Distintivos ","Secretario (Prov)","ASISTENCIAL",4178,11]
[3116,null,null,null,null,null,null,null,null,null,null,null,null,57,null,"2016-02-26",null,null,null,0.56000000000000005,"NO SATISFACTORIO",null,49,null,null,null,6.7,"NO SATISFACTORIO",null,null,null,null,null,null,null,null,null,null,null,null,null,null,null,null,null,null,null,null,null,null,null,null,52428366,"BETANCUR","GIRALDO","LUZ","ADRIANA","Dirección Administrativa","- Grupo de Trabajo de Gestión Documental y Recursos Físicos","Dirección Administrativa - Grupo de Trabajo de Gestión Documental y Recursos Físicos","Auxiliar Administrativo (Prov)","ASISTENCIAL",4044,"08"]
[3118,null,null,null,null,null,null,null,null,null,null,null,null,58,null,"2016-02-27",null,null,null,0.56999999999999995,"NO SATISFACTORIO",null,50,null,null,null,6.8,"NO SATISFACTORIO",null,null,null,null,null,null,null,null,null,null,null,null,null,null,null,null,null,null,null,null,null,null,null,null,1020794953,"BLANCO","ARÉVALO","OMAR","BRAYAM","Dirección Administrativa","- Grupo de Trabajo de Gestión Documental y Recursos Físicos","Dirección Administrativa - Grupo de Trabajo de Gestión Documental y Recursos Físicos","Secretario (Prov)","ASISTENCIAL",4178,"08"]
[3100,null,null,null,null,null,null,null,null,null,null,null,null,59,null,"2016-02-28",null,null,null,0.57999999999999996,"NO SATISFACTORIO",null,51,null,null,null,6.9,"NO SATISFACTORIO",null,null,null,null,null,null,null,null,null,null,null,null,null,null,null,null,null,null,null,null,null,null,null,null,11443548,"BOHÓRQUEZ","SÁNCHEZ","PEDRO","ANDRÉS","Oficina Asesora Jurídica","- Grupo de Trabajo de Cobro Coactivo","Oficina Asesora Jurídica - Grupo de Trabajo de Cobro Coactivo","Profesional Universitario (Prov)","PROFESIONAL",2044,"09"]
[3124,null,null,null,null,null,null,null,null,null,null,null,null,60,null,"2016-02-29",null,null,null,0.59,"NO SATISFACTORIO",null,52,null,null,null,7,"NO SATISFACTORIO",null,null,null,null,null,null,null,null,null,null,null,null,null,null,null,null,null,null,null,null,null,null,null,null,1020725163,"BONILLA","ALDANA","JULIO","MARIO","Despacho del Superintendente Delegado para la Protección de la Competencia",null,"Despacho del Superintendente Delegado para la Protección de la Competencia ","Asesor","ASESOR",1020,"09"]
[3234,null,null,null,null,null,null,null,null,null,null,null,null,61,null,"2016-03-01",null,null,null,0.6,"NO SATISFACTORIO",null,53,null,null,null,7.1,"NO SATISFACTORIO",null,null,null,null,null,null,null,null,null,null,null,null,null,null,null,null,null,null,null,null,null,null,null,null,1030542061,"BONILLA","CHARRY","JOSSUA","FERNANDA","Oficina Asesora Jurídica","- Grupo de Trabajo de Cobro Coactivo","Oficina Asesora Jurídica - Grupo de Trabajo de Cobro Coactivo","Profesional Universitario (Prov)","PROFESIONAL",2044,"01"]
[3128,null,null,null,null,null,null,null,null,null,null,null,null,62,null,"2016-03-02",null,null,null,0.61,"NO SATISFACTORIO",null,54,null,null,null,7.2,"NO SATISFACTORIO",null,null,null,null,null,null,null,null,null,null,null,null,null,null,null,null,null,null,null,null,null,null,null,null,1032356902,"BOTERO","GONZÁLEZ","JUANITA"," -","Despacho del Superintendente Delegado para la Propiedad Industrial","- Grupo de Trabajo de Vía Gubernativa","Despacho del Superintendente Delegado para la Propiedad Industrial - Grupo de Trabajo de Vía Gubernativa","Profesional Universitario (Prov)","PROFESIONAL",2044,"07"]
[3132,null,null,null,null,null,null,null,null,null,null,null,null,63,null,"2016-03-03",null,null,null,0.62,"NO SATISFACTORIO",null,55,null,null,null,7.3,"NO SATISFACTORIO",null,null,null,null,null,null,null,null,null,null,null,null,null,null,null,null,null,null,null,null,null,null,null,null,1026266030,"BRICEÑO","PALACIOS","JORGE","LEONARDO","Dirección de Investigaciones de Protección al Consumidor","","Dirección de Investigaciones de Protección al Consumidor ","Profesional Universitario (Prov)","PROFESIONAL",2044,"01"]
[3136,null,null,null,null,null,null,null,null,null,null,null,null,64,null,"2016-03-04",null,null,null,0.63,"NO SATISFACTORIO",null,56,null,null,null,7.4,"NO SATISFACTORIO",null,null,null,null,null,null,null,null,null,null,null,null,null,null,null,null,null,null,null,null,null,null,null,null,1032379331,"BRICEÑO","RAMÍREZ","NEYIRETH","YURLEY","Oficina Asesora Jurídica","- Grupo de Trabajo de Gestión Judicial","Oficina Asesora Jurídica - Grupo de Trabajo de Gestión Judicial","Profesional Universitario (Prov)","PROFESIONAL",2044,"09"]
[3142,null,null,null,null,null,null,null,null,null,null,null,null,65,null,"2016-03-05",null,null,null,0.64,"NO SATISFACTORIO",null,57,null,null,null,7.5,"NO SATISFACTORIO",null,null,null,null,null,null,null,null,null,null,null,null,null,null,null,null,null,null,null,null,null,null,null,null,80122662,"BUITRAGO","CAYCEDO","MAURICIO","EDUARDO","Dirección de Nuevas Creaciones",null,"Dirección de Nuevas Creaciones ","Técnico Administrativo (Prov)","TECNICO",3124,11]
[3142,null,null,null,null,null,null,null,null,null,null,null,null,66,null,"2016-03-06",null,null,null,0.65010000000000001,"SATISFACTORIO",null,58,null,null,null,7.6,"NO SATISFACTORIO",null,null,null,null,null,null,null,null,null,null,null,null,null,null,null,null,null,null,null,null,null,null,null,null,52992120,"BURBANO","DIAZ","JESSICA"," -","Dirección de Investigaciones de Protección de Usuarios de Servicios de Comunicaciones","- Grupo de Trabajo de Investigaciones Administrativas de Protección de Usuarios de Servicios de Comunicaciones",{"$f":"CONCATENATE(BF67,\" \",BG67)","v":"Dirección de Investigaciones de Protección de Usuarios de Servicios de Comunicaciones - Grupo de Trabajo de Investigaciones Administrativas de Protección de Usuarios de Servicios de Comunicaciones"},"Profesional Universitario (Prov)","PROFESIONAL",2044,11]
[3142,null,null,null,null,null,null,null,null,null,null,null,null,67,null,"2016-03-07",null,null,null,0.66,"SATISFACTORIO",null,59,null,null,null,7.7,"NO SATISFACTORIO",null,null,null,null,null,null,null,null,null,null,null,null,null,null,null,null,null,null,null,null,null,null,null,null,1015407347,"BURGOS","SEPÚLVEDA","WENDY","JUSTINNE","Secretaría General","- Grupo de  Control Disciplinario Interno","Secretaría General - Grupo de  Control Disciplinario Interno","Auxiliar Administrativo (Prov)","ASISTENCIAL",4044,"07"]
[3142,null,null,null,null,null,null,null,null,null,null,null,null,68,null,"2016-03-08",null,null,null,0.67,"SATISFACTORIO",null,60,null,null,null,7.8,"NO SATISFACTORIO",null,null,null,null,null,null,null,null,null,null,null,null,null,null,null,null,null,null,null,null,null,null,null,null,79411714,"BUSTAMANTE","BELLO","JUAN","CARLOS","Dirección Financiera",null,"Dirección Financiera ","Profesional Especializado (En Comisión)","PROFESIONAL",2028,13]
[3142,null,null,null,null,null,null,null,null,null,null,null,null,69,null,"2016-03-09",null,null,null,0.68,"SATISFACTORIO",null,61,null,null,null,7.9,"NO SATISFACTORIO",null,null,null,null,null,null,null,null,null,null,null,null,null,null,null,null,null,null,null,null,null,null,null,null,51787172,"BUSTAMANTE","BELLO","LUZ","STELLA","Dirección de Nuevas Creaciones","","Dirección de Nuevas Creaciones ","Técnico Administrativo (Prov)","TECNICO",3124,15]
[4002,null,null,null,null,null,null,null,null,null,null,null,null,70,null,"2016-03-10",null,null,null,0.69,"SATISFACTORIO",null,62,null,null,null,8,"NO SATISFACTORIO",null,null,null,null,null,null,null,null,null,null,null,null,null,null,null,null,null,null,null,null,null,null,null,null,1016026843,"BUSTAMANTE","GÓMEZ","CAMILO","ALFREDO","Despacho del Superintendente Delegado para la Protección de la Competencia","- Grupo de Trabajo de Protección y Promoción de la Competencia","Despacho del Superintendente Delegado para la Protección de la Competencia - Grupo de Trabajo de Protección y Promoción de la Competencia","Profesional Universitario (Prov)","PROFESIONAL",2044,"07"]
[4006,null,null,null,null,null,null,null,null,null,null,null,null,71,null,"2016-03-11",null,null,null,0.7,"SATISFACTORIO",null,63,null,null,null,8.1,"NO SATISFACTORIO",null,null,null,null,null,null,null,null,null,null,null,null,null,null,null,null,null,null,null,null,null,null,null,null,1010181428,"BUSTOS","MENDOZA","RENE","ALEJANDRO","Oficina Asesora Jurídica","- Grupo de Trabajo de Gestión Judicial","Oficina Asesora Jurídica - Grupo de Trabajo de Gestión Judicial","Profesional Universitario (Prov)","PROFESIONAL",2044,"05"]
[4008,null,null,null,null,null,null,null,null,null,null,null,null,72,null,"2016-03-12",null,null,null,0.71,"SATISFACTORIO",null,64,null,null,null,8.1999999999999993,"NO SATISFACTORIO",null,null,null,null,null,null,null,null,null,null,null,null,null,null,null,null,null,null,null,null,null,null,null,null,21069379,"BUSTOS","VEGA","ISABEL","MATILDE ALICIA","Dirección de Investigaciones para el Control y Verificación de Reglamentos Técnicos y Metrología Legal","","Dirección de Investigaciones para el Control y Verificación de Reglamentos Técnicos y Metrología Legal ","Profesional Universitario","PROFESIONAL",2044,"09"]
[4026,null,null,null,null,null,null,null,null,null,null,null,null,73,null,"2016-03-13",null,null,null,0.72,"SATISFACTORIO",null,65,null,null,null,8.3000000000000007,"NO SATISFACTORIO",null,null,null,null,null,null,null,null,null,null,null,null,null,null,null,null,null,null,null,null,null,null,null,null,92125870,"CABARCAS","MEJÍA","ALFONSO","JOSÉ","Despacho del Superintendente Delegado para la Protección del Consumidor","","Despacho del Superintendente Delegado para la Protección del Consumidor ","Profesional Especializado","PROFESIONAL",2028,17]
[4028,null,null,null,null,null,null,null,null,null,null,null,null,74,null,"2016-03-14",null,null,null,0.73,"SATISFACTORIO",null,66,null,null,null,8.4,"NO SATISFACTORIO",null,null,null,null,null,null,null,null,null,null,null,null,null,null,null,null,null,null,null,null,null,null,null,null,13352624,"CABEZA","ROJAS","DANIEL","ALBERTO","Dirección de Signos Distintivos","- Grupo de Trabajo de Fondo","Dirección de Signos Distintivos - Grupo de Trabajo de Fondo","Técnico Administrativo (Prov)","TECNICO",3124,"07"]
[4032,null,null,null,null,null,null,null,null,null,null,null,null,75,null,"2016-03-15",null,null,null,0.74,"SATISFACTORIO",null,67,null,null,null,8.5,"NO SATISFACTORIO",null,null,null,null,null,null,null,null,null,null,null,null,null,null,null,null,null,null,null,null,null,null,null,null,11185299,"CÁCERES","LIZARAZO","CÉSAR","MARSELO","Dirección Financiera","","Dirección Financiera ","Profesional Universitario (Prov)","PROFESIONAL",2044,"05"]
[4034,null,null,null,null,null,null,null,null,null,null,null,null,76,null,"2016-03-16",null,null,null,0.75,"SATISFACTORIO",null,68,null,null,null,8.6,"NO SATISFACTORIO",null,null,null,null,null,null,null,null,null,null,null,null,null,null,null,null,null,null,null,null,null,null,null,null,80039944,"CADENA","AMAYA","RODOLFO"," -","Dirección de Nuevas Creaciones","- Grupo de Trabajo de Ciencias Químicas","Dirección de Nuevas Creaciones - Grupo de Trabajo de Ciencias Químicas","Profesional Universitario (Prov)","PROFESIONAL",2044,"01"]
[4036,null,null,null,null,null,null,null,null,null,null,null,null,77,null,"2016-03-17",null,null,null,0.76,"SATISFACTORIO",null,69,null,null,null,8.6999999999999993,"NO SATISFACTORIO",null,null,null,null,null,null,null,null,null,null,null,null,null,null,null,null,null,null,null,null,null,null,null,null,59821165,"CAICEDO","CAICEDO","CARMEN","LUCÍA","Oficina de Servicios al Consumidor y de Apoyo Empresarial","- Grupo de Trabajo de Atención al Ciudadano","Oficina de Servicios al Consumidor y de Apoyo Empresarial - Grupo de Trabajo de Atención al Ciudadano","Profesional Universitario (E)","PROFESIONAL",2044,"09"]
[4038,null,null,null,null,null,null,null,null,null,null,null,null,78,null,"2016-03-18",null,null,null,0.77,"SATISFACTORIO",null,70,null,null,null,8.9,"NO SATISFACTORIO",null,null,null,null,null,null,null,null,null,null,null,null,null,null,null,null,null,null,null,null,null,null,null,null,5700539,"CALA","GONZÁLEZ","REINALDO"," -","Dirección de Signos Distintivos","- Grupo de Trabajo de Registro","Dirección de Signos Distintivos - Grupo de Trabajo de Registro","Profesional Universitario (Prov)","PROFESIONAL",2044,"01"]
[4044,null,null,null,null,null,null,null,null,null,null,null,null,79,null,"2016-03-19",null,null,null,0.78,"SATISFACTORIO",null,71,null,null,null,9,"NO SATISFACTORIO",null,null,null,null,null,null,null,null,null,null,null,null,null,null,null,null,null,null,null,null,null,null,null,null,11437424,"CALDAS","GONZALEZ","HERNAN","ALONSO","Dirección Financiera",null,"Dirección Financiera ","Profesional Universitario (Prov)","PROFESIONAL",2044,"05"]
[4048,null,null,null,null,null,null,null,null,null,null,null,null,80,null,"2016-03-20",null,null,null,0.79,"SATISFACTORIO",null,72,null,null,"CUATRO",9.1,"NO SATISFACTORIO",null,null,null,null,null,null,null,null,null,null,null,null,null,null,null,null,null,null,null,null,null,null,null,null,1143836938,"CALDERÓN","BURBANO","MARIA","PAULA","Despacho del Superintendente Delegado para Asuntos Jurisdiccionales","- Grupo de Trabajo para la Verificación del Cumplimiento","Despacho del Superintendente Delegado para Asuntos Jurisdiccionales - Grupo de Trabajo para la Verificación del Cumplimiento","Profesional Universitario (Prov)","PROFESIONAL",2044,"01"]
[4056,null,null,null,null,null,null,null,null,null,null,null,null,81,null,"2016-03-21",null,null,null,0.8,"DESTACADO",null,73,null,null,null,9.1999999999999993,"NO SATISFACTORIO",null,null,null,null,null,null,null,null,null,null,null,null,null,null,null,null,null,null,null,null,null,null,null,null,19409146,"CAMACHO","GARCÍA","RICARDO","AURELIO","Despacho del Superintendente Delegado para la Propiedad Industrial","- Grupo de Trabajo de Vía Gubernativa","Despacho del Superintendente Delegado para la Propiedad Industrial - Grupo de Trabajo de Vía Gubernativa","Profesional Especializado (Prov)","PROFESIONAL",2028,17]
[4064,null,null,null,null,null,null,null,null,null,null,null,null,82,null,"2016-03-22",null,null,null,0.81,"DESTACADO",null,74,null,null,null,9.3000000000000007,"NO SATISFACTORIO",null,null,null,null,null,null,null,null,null,null,null,null,null,null,null,null,null,null,null,null,null,null,null,null,37864490,"CAMELO","CHACON","HADIT"," -","Despacho del Superintendente Delegado para la Protección de la Competencia","","Despacho del Superintendente Delegado para la Protección de la Competencia ","Profesional Universitario (Prov)","PROFESIONAL",2044,"09"]
[4069,null,null,null,null,null,null,null,null,null,null,null,null,83,null,"2016-03-23",null,null,null,0.82,"DESTACADO",null,75,null,null,null,9.4,"NO SATISFACTORIO",null,null,null,null,null,null,null,null,null,null,null,null,null,null,null,null,null,null,null,null,null,null,null,null,94540495,"CAMPO","ROBLEDO","JACOBO","ALBERTO","Oficina Asesora de Planeación","- Grupo de Trabajo de Estudios Económicos","Oficina Asesora de Planeación - Grupo de Trabajo de Estudios Económicos","Profesional Universitario (Prov)","PROFESIONAL",2044,11]
[4078,null,null,null,null,null,null,null,null,null,null,null,null,84,null,"2016-03-24",null,null,null,0.83,"DESTACADO",null,76,null,null,null,9.5,"NO SATISFACTORIO",null,null,null,null,null,null,null,null,null,null,null,null,null,null,null,null,null,null,null,null,null,null,null,null,1033733831,"CANIZALEZ","MANIOS","JHON","JAIRO","Dirección de Investigaciones de Protección de Usuarios de Servicios de Comunicaciones","- Grupo de Trabajo de Investigaciones Administrativas de Protección de Usuarios de Servicios de Comunicaciones","Dirección de Investigaciones de Protección de Usuarios de Servicios de Comunicaciones - Grupo de Trabajo de Investigaciones Administrativas de Protección de Usuarios de Servicios de Comunicaciones","Técnico Administrativo (Prov)","TECNICO",3124,11]
[4097,null,null,null,null,null,null,null,null,null,null,null,null,85,null,"2016-03-25",null,null,null,0.84,"DESTACADO",null,77,null,null,null,9.6,"NO SATISFACTORIO",null,null,null,null,null,null,null,null,null,null,null,null,null,null,null,null,null,null,null,null,null,null,null,null,52063996,"CÁRDENAS","GÓMEZ","ZULMA","YOLIMA","Dirección de Cámaras de Comercio","- Grupo de Trabajo de Trámites Administrativos","Dirección de Cámaras de Comercio - Grupo de Trabajo de Trámites Administrativos","Profesional Universitario (Prov)","PROFESIONAL",2044,10]
[4097,null,null,null,null,null,null,null,null,null,null,null,null,86,null,"2016-03-26",null,null,null,0.85,"DESTACADO",null,78,null,null,null,9.6999999999999993,"NO SATISFACTORIO",null,null,null,null,null,null,null,null,null,null,null,null,null,null,null,null,null,null,null,null,null,null,null,null,1030561925,"CÁRDENAS","LOZANO","MELISA","JULIETH","Secretaría General","- Grupo de Trabajo de Talento Humano","Secretaría General - Grupo de Trabajo de Talento Humano","Profesional Universitario (Prov)","PROFESIONAL",2044,"01"]
[4097,null,null,null,null,null,null,null,null,null,null,null,null,87,null,"2016-03-27",null,null,null,0.86,"DESTACADO",null,79,null,null,null,9.8000000000000007,"NO SATISFACTORIO",null,null,null,null,null,null,null,null,null,null,null,null,null,null,null,null,null,null,null,null,null,null,null,null,1016028068,"CÁRDENAS","QUINTERO","FELIPE","ALFONSO","Despacho del Superintendente Delegado para la Protección de la Competencia","- Grupo de Trabajo de Prácticas Restrictivas de la Competencia","Despacho del Superintendente Delegado para la Protección de la Competencia - Grupo de Trabajo de Prácticas Restrictivas de la Competencia","Profesional Universitario (Prov)","PROFESIONAL",2044,"01"]
[4097,null,null,null,null,null,null,null,null,null,null,null,null,88,null,"2016-03-28",null,null,null,0.87,"DESTACADO",null,80,null,null,null,9.9,"NO SATISFACTORIO",null,null,null,null,null,null,null,null,null,null,null,null,null,null,null,null,null,null,null,null,null,null,null,null,10241235,"CÁRDENAS","RAMÍREZ","MARIO","GUSTAVO","Dirección de Investigaciones de Protección al Consumidor","","Dirección de Investigaciones de Protección al Consumidor ","Profesional Universitario","PROFESIONAL",2044,10]
[4097,null,null,null,null,null,null,null,null,null,null,null,null,89,null,"2016-03-29",null,null,null,0.88,"DESTACADO",null,81,null,null,null,10,"NO SATISFACTORIO",null,null,null,null,null,null,null,null,null,null,null,null,null,null,null,null,null,null,null,null,null,null,null,null,19214395,"CÁRDENAS","RAMÍREZ","RAMÓN","FRANCISCO","Oficina Asesora Jurídica","- Grupo de Trabajo de Gestión Judicial","Oficina Asesora Jurídica - Grupo de Trabajo de Gestión Judicial","Profesional Especializado (E)","PROFESIONAL",2028,17]
[4103,null,null,null,null,null,null,null,null,null,null,null,null,90,null,"2016-03-30",null,null,null,0.89,"DESTACADO",null,82,null,null,null,10.1,"NO SATISFACTORIO",null,null,null,null,null,null,null,null,null,null,null,null,null,null,null,null,null,null,null,null,null,null,null,null,52730128,"CARDOZO","MORALES","SANDRA","JOHANNA","Secretaría General","- Grupo de Trabajo de Notificaciones y Certificaciones","Secretaría General - Grupo de Trabajo de Notificaciones y Certificaciones","Auxiliar Administrativo (Prov)","ASISTENCIAL",4044,"09"]
[4112,null,null,null,null,null,null,null,null,null,null,null,null,91,null,"2016-03-31",null,null,null,0.9,"DESTACADO",null,83,null,null,null,10.199999999999999,"NO SATISFACTORIO",null,null,null,null,null,null,null,null,null,null,null,null,null,null,null,null,null,null,null,null,null,null,null,null,22461090,"CARO","NAVARRO","DORA","DEL CARMEN","Despacho del Superintendente Delegado para la Protección del Consumidor","- Grupo de Trabajo de Apoyo a la Red Nacional de Protección al Consumidor","Despacho del Superintendente Delegado para la Protección del Consumidor - Grupo de Trabajo de Apoyo a la Red Nacional de Protección al Consumidor","Asesor","ASESOR",1020,"06"]
[4114,null,null,null,null,null,null,null,null,null,null,null,null,92,null,"2016-04-01",null,null,null,0.91,"DESTACADO",null,84,null,null,null,10.3,"NO SATISFACTORIO",null,null,null,null,null,null,null,null,null,null,null,null,null,null,null,null,null,null,null,null,null,null,null,null,51833869,"CARO","PUERTA","MARTA","CECILIA","Oficina de Control Interno",null,"Oficina de Control Interno ","Profesional Especializado (E)","PROFESIONAL",2028,13]
[4123,null,null,null,null,null,null,null,null,null,null,null,null,93,null,"2016-04-02",null,null,null,0.93,"DESTACADO",null,85,null,null,null,10.4,"NO SATISFACTORIO",null,null,null,null,null,null,null,null,null,null,null,null,null,null,null,null,null,null,null,null,null,null,null,null,52474020,"CARRILLO","LÓPEZ","GINNA","MILENA","Dirección de Nuevas Creaciones",null,"Dirección de Nuevas Creaciones ","Secretario (Prov)","ASISTENCIAL",4178,"08"]
[4128,null,null,null,null,null,null,null,null,null,null,null,null,94,null,"2016-04-03",null,null,null,0.94,"DESTACADO",null,86,null,null,null,10.5,"NO SATISFACTORIO",null,null,null,null,null,null,null,null,null,null,null,null,null,null,null,null,null,null,null,null,null,null,null,null,65550556,"CARRILLO","PACHECO","MARY"," -","Oficina Asesora de Planeación",null,"Oficina Asesora de Planeación ","Profesional Universitario (E)","PROFESIONAL",2044,11]
[4137,null,null,null,null,null,null,null,null,null,null,null,null,95,null,"2016-04-04",null,null,null,0.95,"SOBRESALIENTE",null,87,null,null,null,10.6,"NO SATISFACTORIO",null,null,null,null,null,null,null,null,null,null,null,null,null,null,null,null,null,null,null,null,null,null,null,null,1026250420,"CARRILLO","RAMÍIREZ","CATALINA"," -","Despacho del Superintendente Delegado para la Propiedad Industrial",null,"Despacho del Superintendente Delegado para la Propiedad Industrial ","Profesional Universitario (Prov)","PROFESIONAL",2044,"05"]
[4152,null,null,null,null,null,null,null,null,null,null,null,null,96,null,"2016-04-05",null,null,null,0.96,"SOBRESALIENTE",null,88,null,null,null,10.7,"NO SATISFACTORIO",null,null,null,null,null,null,null,null,null,null,null,null,null,null,null,null,null,null,null,null,null,null,null,null,67039975,"CARRILLO","ZULUAGA","PAOLA","ANDREA","Oficina Asesora de Planeación","- Grupo de Trabajo de Asuntos Internacionales","Oficina Asesora de Planeación - Grupo de Trabajo de Asuntos Internacionales","Profesional Universitario (Prov)","PROFESIONAL",2044,11]
[4158,null,null,null,null,null,null,null,null,null,null,null,null,97,null,"2016-04-06",null,null,null,0.97,"SOBRESALIENTE",null,89,null,null,null,10.8,"NO SATISFACTORIO",null,null,null,null,null,null,null,null,null,null,null,null,null,null,null,null,null,null,null,null,null,null,null,null,52804593,"CARVAJAL","CIFUENTES","JENNY","PATRICIA","Oficina Asesora Jurídica","- Grupo de Trabajo de Cobro Coactivo","Oficina Asesora Jurídica - Grupo de Trabajo de Cobro Coactivo","Profesional Universitario (Prov)","PROFESIONAL",2044,"03"]
[4167,null,null,null,null,null,null,null,null,null,null,null,null,98,null,"2016-04-07",null,null,null,0.98,"SOBRESALIENTE",null,90,null,null,null,10.9,"NO SATISFACTORIO",null,null,null,null,null,null,null,null,null,null,null,null,null,null,null,null,null,null,null,null,null,null,null,null,1032422404,"CARVAJAL","GUERRA","JUANITA","ANDREA","Dirección de Nuevas Creaciones","- Grupo de Trabajo de Ciencias Farmacéuticas y Biológicas","Dirección de Nuevas Creaciones - Grupo de Trabajo de Ciencias Farmacéuticas y Biológicas","Profesional Universitario (Prov)","PROFESIONAL",2044,"01"]
[4169,null,null,null,null,null,null,null,null,null,null,null,null,99,null,"2016-04-08",null,null,null,0.99,"SOBRESALIENTE",null,91,null,null,null,11,"NO SATISFACTORIO",null,null,null,null,null,null,null,null,null,null,null,null,null,null,null,null,null,null,null,null,null,null,null,null,28428644,"CARVAJAL","PINZÓN","CLAIRE"," -","Dirección Administrativa",null,"Dirección Administrativa ","Profesional Especializado ","PROFESIONAL",2028,13]
[4173,null,null,null,null,null,null,null,null,null,null,null,null,100,null,"2016-04-09",null,null,null,1,"SOBRESALIENTE",null,92,null,null,null,11.1,"NO SATISFACTORIO",null,null,null,null,null,null,null,null,null,null,null,null,null,null,null,null,null,null,null,null,null,null,null,null,38565923,"CASAÑAS","MUÑOZ","DIANA","CAROLINA","Oficina de Servicios al Consumidor y de Apoyo Empresarial","- Grupo de Trabajo de Atención al Ciudadano","Oficina de Servicios al Consumidor y de Apoyo Empresarial - Grupo de Trabajo de Atención al Ciudadano","Profesional Universitario (Prov)","PROFESIONAL",2044,"07"]
[4178,null,null,null,null,null,null,null,null,null,null,null,null,null,null,"2016-04-10",null,null,null,1.01,"SOBRESALIENTE",null,93,null,null,null,11.2,"NO SATISFACTORIO",null,null,null,null,null,null,null,null,null,null,null,null,null,null,null,null,null,null,null,null,null,null,null,null,52989172,"CASTAÑEDA","DIAZ","SANDRA","JOHANNA","Despacho del Superintendente Delegado para Asuntos Jurisdiccionales","- Grupo de Trabajo de Calificación","Despacho del Superintendente Delegado para Asuntos Jurisdiccionales - Grupo de Trabajo de Calificación","Profesional Universitario (Prov)","PROFESIONAL",2044,"01"]
[4182,null,null,null,null,null,null,null,null,null,null,null,null,0.98,null,"2016-04-11",null,null,null,null,null,null,94,null,null,null,11.3,"NO SATISFACTORIO",null,null,null,null,null,null,null,null,null,null,null,null,null,null,null,null,null,null,null,null,null,null,null,null,79106005,"CASTAÑO","VARGAS","ORLANDO"," -","Dirección de Investigaciones de Protección de Usuarios de Servicios de Comunicaciones","- Grupo de Trabajo de Investigaciones Administrativas de Protección de Usuarios de Servicios de Comunicaciones","Dirección de Investigaciones de Protección de Usuarios de Servicios de Comunicaciones - Grupo de Trabajo de Investigaciones Administrativas de Protección de Usuarios de Servicios de Comunicaciones","Profesional Universitario (Prov)","PROFESIONAL",2044,"03"]
[4210,null,null,null,null,null,null,null,null,null,null,null,null,0.99,null,"2016-04-12",null,null,null,null,null,null,95,null,null,null,11.4,"NO SATISFACTORIO",null,null,null,null,null,null,null,null,null,null,null,null,null,null,null,null,null,null,null,null,null,null,null,null,52776777,"CASTELBLANCO","MUÑOZ","GISELLE","JOHANNA","Oficina Asesora de Planeación",null,"Oficina Asesora de Planeación ","Jefe de Oficina Asesora de Planeación","ASESOR",1045,"09"]
[4212,null,null,null,null,null,null,null,null,null,null,null,null,1,null,"2016-04-13",null,null,null,null,null,null,96,null,null,null,11.5,"NO SATISFACTORIO",null,null,null,null,null,null,null,null,null,null,null,null,null,null,null,null,null,null,null,null,null,null,null,null,53045413,"CASTELLANOS","BARRAGAN","ZAHIRA","NATHALIA","Despacho del Superintendente Delegado para la Propiedad Industrial","- Grupo de Trabajo de Vía Gubernativa","Despacho del Superintendente Delegado para la Propiedad Industrial - Grupo de Trabajo de Vía Gubernativa","Auxiliar Administrativo (Prov)","ASISTENCIAL",4044,11]
[4215,null,null,null,null,null,null,null,null,null,null,null,null,null,null,"2016-04-14",null,null,null,null,null,null,97,null,null,null,11.6,"NO SATISFACTORIO",null,null,null,null,null,null,null,null,null,null,null,null,null,null,null,null,null,null,null,null,null,null,null,null,80245004,"CASTELLANOS","CORRALES","WILLIAM","ERNESTO","Dirección de Investigaciones de Protección al Consumidor","- Grupo de Trabajo de Supervisión Empresarial y Seguridad de Producto","Dirección de Investigaciones de Protección al Consumidor - Grupo de Trabajo de Supervisión Empresarial y Seguridad de Producto","Auxiliar Administrativo (Prov)","ASISTENCIAL",4044,11]
[4220,null,null,null,null,null,null,null,null,null,null,null,null,null,null,"2016-04-15",null,null,null,null,null,null,98,null,null,"CINCO",11.7,"NO SATISFACTORIO",null,null,null,null,null,null,null,null,null,null,null,null,null,null,null,null,null,null,null,null,null,null,null,null,39677444,"CASTELLANOS","RODRÍGUEZ","LYNDA","MARÍA CRISTINA","Dirección Administrativa","- Grupo de Trabajo de Gestión Documental y Recursos Físicos","Dirección Administrativa - Grupo de Trabajo de Gestión Documental y Recursos Físicos","Auxiliar Administrativo (Prov)","ASISTENCIAL",4044,"08"]
[4222,null,null,null,null,null,null,null,null,null,null,null,null,null,null,"2016-04-16",null,null,null,null,null,null,99,null,null,null,11.8,"NO SATISFACTORIO",null,null,null,null,null,null,null,null,null,null,null,null,null,null,null,null,null,null,null,null,null,null,null,null,79939549,"CASTELLANOS","SANDOVAL","LUIS","JAVIER","Despacho del Superintendente","- Grupo de Trabajo Interdisciplinario de Colusiones","Despacho del Superintendente - Grupo de Trabajo Interdisciplinario de Colusiones","Asesor","ASESOR",1020,"06"]
[4225,null,null,null,null,null,null,null,null,null,null,null,null,null,null,"2016-04-17",null,null,null,null,null,null,100,null,null,null,11.9,"NO SATISFACTORIO",null,null,null,null,null,null,null,null,null,null,null,null,null,null,null,null,null,null,null,null,null,null,null,null,52710676,"CASTIBLANCO","GARCÍA","YENNY","PAOLA","Oficina de Servicios al Consumidor y de Apoyo Empresarial","- Grupo de Trabajo de Comunicación","Oficina de Servicios al Consumidor y de Apoyo Empresarial - Grupo de Trabajo de Comunicación","Profesional Universitario (Prov)","PROFESIONAL",2044,"01"]
[4225,null,null,null,null,null,null,null,null,null,null,null,null,null,null,"2016-04-18",null,null,null,null,null,null,101,null,null,null,12,"NO SATISFACTORIO",null,null,null,null,null,null,null,null,null,null,null,null,null,null,null,null,null,null,null,null,null,null,null,null,1032391401,"CASTIBLANCO","RINCÓN","DANIEL","ALEJANDRO","Despacho del Superintendente Delegado para la Propiedad Industrial","- Grupo de Trabajo de Centro de Información Tecnológica y Apoyo a la Gestión de la Propiedad Industrial","Despacho del Superintendente Delegado para la Propiedad Industrial - Grupo de Trabajo de Centro de Información Tecnológica y Apoyo a la Gestión de la Propiedad Industrial","Profesional Universitario (Prov)","PROFESIONAL",2044,"03"]
[null,null,null,null,null,null,null,null,null,null,null,null,null,null,null,"2016-04-19",null,null,null,null,null,null,102,null,null,null,12.1,"NO SATISFACTORIO",null,null,null,null,null,null,null,null,null,null,null,null,null,null,null,null,null,null,null,null,null,null,null,null,20714949,"CASTIBLANCO","URQUIJO","NELLY","PATRICIA","Secretaría General","- Grupo de Trabajo de Notificaciones y Certificaciones","Secretaría General - Grupo de Trabajo de Notificaciones y Certificaciones","Técnico Administrativo (Prov)","TECNICO",3124,"07"]
[null,null,null,null,null,null,null,null,null,null,null,null,null,null,null,"2016-04-20",null,null,null,null,null,null,103,null,null,null,12.2,"NO SATISFACTORIO",null,null,null,null,null,null,null,null,null,null,null,null,null,null,null,null,null,null,null,null,null,null,null,null,79321962,"CASTILLO","BELTRÁN","RICARDO"," -","Dirección Financiera",null,"Dirección Financiera ","Director de Superintendencia","DIRECTIVO","0105",11]
["Agregado para Asuntos Aéreos",null,null,null,null,null,null,null,null,null,null,null,null,null,null,"2016-04-21",null,null,null,null,null,null,104,null,null,null,12.3,"NO SATISFACTORIO",null,null,null,null,null,null,null,null,null,null,null,null,null,null,null,null,null,null,null,null,null,null,null,null,7700461,"CASTILLO","GUZMAN","DIEGO","ANDRÉS","Despacho del Superintendente Delegado para Asuntos Jurisdiccionales","- Grupo de Trabajo de Competencia Desleal y Propiedad Industrial","Despacho del Superintendente Delegado para Asuntos Jurisdiccionales - Grupo de Trabajo de Competencia Desleal y Propiedad Industrial","Profesional Universitario (Prov)","PROFESIONAL",2044,"09"]
["Asesor",null,null,null,null,null,null,null,null,null,null,null,null,null,null,"2016-04-22",null,null,null,null,null,null,105,null,null,null,12.4,"NO SATISFACTORIO",null,null,null,null,null,null,null,null,null,null,null,null,null,null,null,null,null,null,null,null,null,null,null,null,51948325,"CASTILLO","LUNA","LUZ","FERNANDA","Oficina de Servicios al Consumidor y de Apoyo Empresarial","- Grupo de Trabajo Aula de Propiedad Industrial","Oficina de Servicios al Consumidor y de Apoyo Empresarial - Grupo de Trabajo Aula de Propiedad Industrial","Secretario (E)","ASISTENCIAL",4178,13]
["Asesor Comercial",null,null,null,null,null,null,null,null,null,null,null,null,null,null,"2016-04-23",null,null,null,null,null,null,106,null,null,null,12.5,"NO SATISFACTORIO",null,null,null,null,null,null,null,null,null,null,null,null,null,null,null,null,null,null,null,null,null,null,null,null,28477881,"CASTILLO","OLAVE","ROSALBA"," -","Despacho del Superintendente Delegado para la Protección de la Competencia","- Grupo de Trabajo de Protección y Promoción de la Competencia","Despacho del Superintendente Delegado para la Protección de la Competencia - Grupo de Trabajo de Protección y Promoción de la Competencia","Secretario Ejecutivo (E)","ASISTENCIAL",4210,18]
["Jefe de Oficina Asesora de Comunicaciones o de Prensa o de Jurídica o de Planeación",null,null,null,null,null,null,null,null,null,null,null,null,null,null,"2016-04-24",null,null,null,null,null,null,107,null,null,null,12.6,"NO SATISFACTORIO",null,null,null,null,null,null,null,null,null,null,null,null,null,null,null,null,null,null,null,null,null,null,null,null,1010181179,"CASTILLO","PORRAS","MÓNICA","JULIETH","Despacho del Superintendente Delegado para la Protección de la Competencia",null,"Despacho del Superintendente Delegado para la Protección de la Competencia ","Profesional Universitario (Prov)","PROFESIONAL",2044,11]
["Administrador de Parques Nacionales",null,null,null,null,null,null,null,null,null,null,null,null,null,null,"2016-04-25",null,null,null,null,null,null,108,null,null,null,12.7,"NO SATISFACTORIO",null,null,null,null,null,null,null,null,null,null,null,null,null,null,null,null,null,null,null,null,null,null,null,null,79383975,"CASTRILLÓN","ATEHORTÚA","LUIS","FERNANDO","Dirección de Investigaciones de Protección al Consumidor","- Grupo de Trabajo de Supervisión Empresarial y Seguridad de Producto","Dirección de Investigaciones de Protección al Consumidor - Grupo de Trabajo de Supervisión Empresarial y Seguridad de Producto","Profesional Universitario (E)","PROFESIONAL",2044,"07"]
["Jefe de Área protegida",null,null,null,null,null,null,null,null,null,null,null,null,null,null,"2016-04-26",null,null,null,null,null,null,109,null,null,null,12.8,"NO SATISFACTORIO",null,null,null,null,null,null,null,null,null,null,null,null,null,null,null,null,null,null,null,null,null,null,null,null,51706301,"CASTRO","ANGARITA","BLANCA","ISABEL","Despacho del Superintendente Delegado para la Propiedad Industrial","","Despacho del Superintendente Delegado para la Propiedad Industrial ","Asesor","ASESOR",1020,"05"]
["Capellán",null,null,null,null,null,null,null,null,null,null,null,null,null,null,"2016-04-27",null,null,null,null,null,null,110,null,null,null,12.9,"NO SATISFACTORIO",null,null,null,null,null,null,null,null,null,null,null,null,null,null,null,null,null,null,null,null,null,null,null,null,51793389,"CASTRO","CORTÉS","MELBA","GERARDINA","Despacho del Superintendente Delegado para la Protección de la Competencia","","Despacho del Superintendente Delegado para la Protección de la Competencia ","Profesional Especializado (E)","PROFESIONAL",2028,17]
["Comandante Superior de Prisiones",null,null,null,null,null,null,null,null,null,null,null,null,null,null,"2016-04-28",null,null,null,null,null,null,111,null,null,null,13,"NO SATISFACTORIO",null,null,null,null,null,null,null,null,null,null,null,null,null,null,null,null,null,null,null,null,null,null,null,null,20455334,"CAVIEDES","MEJÍA","MARÍA","CLAUDIA","Despacho del Superintendente Delegado para la Protección de Datos Personales","","Despacho del Superintendente Delegado para la Protección de Datos Personales ","Superintendente Delegado","DIRECTIVO","0110",19]
["Consejero de Relaciones Exteriores",null,null,null,null,null,null,null,null,null,null,null,null,null,null,"2016-04-29",null,null,null,null,null,null,112,null,null,null,13.1,"NO SATISFACTORIO",null,null,null,null,null,null,null,null,null,null,null,null,null,null,null,null,null,null,null,null,null,null,null,null,21238402,"CAYCEDO","RICO","MARÍA","STELLA","Dirección de Signos Distintivos","","Dirección de Signos Distintivos ","Técnico Administrativo (E)","TECNICO",3124,15]
["Copiloto de Aviación",null,null,null,null,null,null,null,null,null,null,null,null,null,null,"2016-04-30",null,null,null,null,null,null,113,null,null,null,13.2,"NO SATISFACTORIO",null,null,null,null,null,null,null,null,null,null,null,null,null,null,null,null,null,null,null,null,null,null,null,null,35314114,"CEPEDA","CIFUENTES","LUZ","JANNETH","Dirección Administrativa","- Grupo de Trabajo de Gestión Documental y Recursos Físicos","Dirección Administrativa - Grupo de Trabajo de Gestión Documental y Recursos Físicos","Técnico Administrativo (E)","TECNICO",3124,11]
["Defensor de Familia",null,null,null,null,null,null,null,null,null,null,null,null,null,null,"2016-05-01",null,null,null,null,null,null,114,null,null,null,13.3,"NO SATISFACTORIO",null,null,null,null,null,null,null,null,null,null,null,null,null,null,null,null,null,null,null,null,null,null,null,null,35314115,"CEPEDA","CIFUENTES","NANCY"," -","Dirección de Investigaciones de Protección de Usuarios de Servicios de Comunicaciones","","Dirección de Investigaciones de Protección de Usuarios de Servicios de Comunicaciones ","Secretario (Prov)","ASISTENCIAL",4178,13]
["Director de Establecimiento Carcelario",null,null,null,null,null,null,null,null,null,null,null,null,null,null,"2016-05-02",null,null,null,null,null,null,115,null,null,null,13.4,"NO SATISFACTORIO",null,null,null,null,null,null,null,null,null,null,null,null,null,null,null,null,null,null,null,null,null,null,null,null,12998265,"CHAMORRO","RÚALES","GIOVANY","JAVIER","Oficina de Control Interno",null,"Oficina de Control Interno ","Jefe de Oficina","DIRECTIVO","0137",16]
["Especialista Asesor Primero",null,null,null,null,null,null,null,null,null,null,null,null,null,null,"2016-05-03",null,null,null,null,null,null,116,null,null,null,13.5,"NO SATISFACTORIO",null,null,null,null,null,null,null,null,null,null,null,null,null,null,null,null,null,null,null,null,null,null,null,null,79523516,"CHAPARRO","VÉLEZ","JUAN","CARLOS","Dirección de Nuevas Creaciones",null,"Dirección de Nuevas Creaciones ","Técnico Administrativo (Prov)","TECNICO",3124,"09"]
["Especialista Jefe",null,null,null,null,null,null,null,null,null,null,null,null,null,null,"2016-05-04",null,null,null,null,null,null,117,null,null,null,13.6,"NO SATISFACTORIO",null,null,null,null,null,null,null,null,null,null,null,null,null,null,null,null,null,null,null,null,null,null,null,null,52074206,"CHAVES","GARCIA","DIANA","MILENA","Dirección Administrativa","- Grupo de Trabajo de Gestión Documental y Recursos Físicos","Dirección Administrativa - Grupo de Trabajo de Gestión Documental y Recursos Físicos","Auxiliar Administrativo (Prov)","ASISTENCIAL",4044,"08"]
["Inspector de Trabajo y Seguridad Social",null,null,null,null,null,null,null,null,null,null,null,null,null,null,"2016-05-05",null,null,null,null,null,null,118,null,null,null,13.7,"NO SATISFACTORIO",null,null,null,null,null,null,null,null,null,null,null,null,null,null,null,null,null,null,null,null,null,null,null,null,79623243,"CHAVES","MACHUCA","JOSÉ","ARTURO","Despacho del Superintendente Delegado para la Propiedad Industrial",null,"Despacho del Superintendente Delegado para la Propiedad Industrial ","Profesional Universitario (Prov)","PROFESIONAL",2044,"09"]
["Inspector de Trabajo y Seguridad Social Especializado",null,null,null,null,null,null,null,null,null,null,null,null,null,null,"2016-05-06",null,null,null,null,null,null,119,null,null,null,13.8,"NO SATISFACTORIO",null,null,null,null,null,null,null,null,null,null,null,null,null,null,null,null,null,null,null,null,null,null,null,null,86083988,"CHAVES","TORRES","LEYVER","ALFONSO","Dirección de Investigaciones de Protección al Consumidor","","Dirección de Investigaciones de Protección al Consumidor ","Técnico Administrativo (Prov)","TECNICO",3124,11]
["Médico",null,null,null,null,null,null,null,null,null,null,null,null,null,null,"2016-05-07",null,null,null,null,null,null,120,null,null,null,13.9,"NO SATISFACTORIO",null,null,null,null,null,null,null,null,null,null,null,null,null,null,null,null,null,null,null,null,null,null,null,null,1098635328,"CHÍA","DELGADO","LEIDY","DIANA","Dirección Administrativa","- Grupo de Trabajo de Gestión Documental y Recursos Físicos","Dirección Administrativa - Grupo de Trabajo de Gestión Documental y Recursos Físicos","Técnico Administrativo (Prov)","TECNICO",3124,11]
["Médico Especialista",null,null,null,null,null,null,null,null,null,null,null,null,null,null,"2016-05-08",null,null,null,null,null,null,121,null,null,null,14,"NO SATISFACTORIO",null,null,null,null,null,null,null,null,null,null,null,null,null,null,null,null,null,null,null,null,null,null,null,null,1020751093,"CIFUENTES","CASTRO","ANDRÉS","FELIPE","Despacho del Superintendente Delegado para la Protección de la Competencia","- Grupo de Trabajo de Protección y Promoción de la Competencia","Despacho del Superintendente Delegado para la Protección de la Competencia - Grupo de Trabajo de Protección y Promoción de la Competencia","Profesional Universitario (Prov)","PROFESIONAL",2044,"01"]
["Odontólogo",null,null,null,null,null,null,null,null,null,null,null,null,null,null,"2016-05-09",null,null,null,null,null,null,122,null,null,null,14.1,"NO SATISFACTORIO",null,null,null,null,null,null,null,null,null,null,null,null,null,null,null,null,null,null,null,null,null,null,null,null,39644063,"CIFUENTES","MUÑOZ","FLOR","MARINA","Oficina de Servicios al Consumidor y de Apoyo Empresarial","- Grupo de Trabajo de Atención al Ciudadano",{"$f":"CONCATENATE(BF131,\" \",BG131)","v":"Oficina de Servicios al Consumidor y de Apoyo Empresarial - Grupo de Trabajo de Atención al Ciudadano"},"Profesional Universitario (E)","PROFESIONAL",2044,"03"]
["Odontólogo Especialista",null,null,null,null,null,null,null,null,null,null,null,null,null,null,"2016-05-10",null,null,null,null,null,null,123,null,null,null,14.2,"NO SATISFACTORIO",null,null,null,null,null,null,null,null,null,null,null,null,null,null,null,null,null,null,null,null,null,null,null,null,1012379301,"COLMENARES","GONZÁLEZ","YEIMY","LORENA","Secretaría General","- Grupo de Trabajo de Talento Humano","Secretaría General - Grupo de Trabajo de Talento Humano","Técnico Administrativo (Prov)","TECNICO",3124,"09"]
["Oficial Logístico",null,null,null,null,null,null,null,null,null,null,null,null,null,null,"2016-05-11",null,null,null,null,null,null,124,null,null,"SEIS",14.3,"NO SATISFACTORIO",null,null,null,null,null,null,null,null,null,null,null,null,null,null,null,null,null,null,null,null,null,null,null,null,1047365237,"CONTRERAS","CASTRO","ROXANA"," -","Despacho del Superintendente Delegado para Asuntos Jurisdiccionales","- Grupo de Trabajo de Calificación","Despacho del Superintendente Delegado para Asuntos Jurisdiccionales - Grupo de Trabajo de Calificación","Profesional Universitario (Prov)","PROFESIONAL",2044,"03"]
["Oficial de Tratamiento Penitenciario",null,null,null,null,null,null,null,null,null,null,null,null,null,null,"2016-05-12",null,null,null,null,null,null,125,null,null,null,14.4,"NO SATISFACTORIO",null,null,null,null,null,null,null,null,null,null,null,null,null,null,null,null,null,null,null,null,null,null,null,null,51985760,"CONTRERAS","MORALES","ELIZABETH"," -","Dirección Administrativa",null,"Dirección Administrativa ","Secretario Ejecutivo (Prov)","ASISTENCIAL",4210,16]
["Pastor u Orientador Espiritual",null,null,null,null,null,null,null,null,null,null,null,null,null,null,"2016-05-13",null,null,null,null,null,null,126,null,null,null,14.5,"NO SATISFACTORIO",null,null,null,null,null,null,null,null,null,null,null,null,null,null,null,null,null,null,null,null,null,null,null,null,27805134,"CONTRERAS","RIOS","NELLY","ESPERANZA","Dirección Administrativa","- Grupo de Trabajo de Contratación","Dirección Administrativa - Grupo de Trabajo de Contratación","Profesional Universitario (Prov)","PROFESIONAL",2044,"09"]
["Piloto de Aviación",null,null,null,null,null,null,null,null,null,null,null,null,null,null,"2016-05-14",null,null,null,null,null,null,127,null,null,null,14.6,"NO SATISFACTORIO",null,null,null,null,null,null,null,null,null,null,null,null,null,null,null,null,null,null,null,null,null,null,null,null,30723682,"CORAL","OJEDA","NOHORA","MARLENY","Oficina de Servicios al Consumidor y de Apoyo Empresarial","- Grupo de Trabajo de Comunicación","Oficina de Servicios al Consumidor y de Apoyo Empresarial - Grupo de Trabajo de Comunicación","Profesional Universitario (E)","PROFESIONAL",2044,"09"]
["Primer Secretario de Relaciones Exteriores",null,null,null,null,null,null,null,null,null,null,null,null,null,null,"2016-05-15",null,null,null,null,null,null,128,null,null,null,14.7,"NO SATISFACTORIO",null,null,null,null,null,null,null,null,null,null,null,null,null,null,null,null,null,null,null,null,null,null,null,null,52866666,"CORCIONE","MORALES","MARIA","CAROLINA","Dirección de Investigaciones de Protección al Consumidor","","Dirección de Investigaciones de Protección al Consumidor ","Director de Superintendencia","DIRECTIVO","0105",11]
["Profesional de Gestión Institucional",null,null,null,null,null,null,null,null,null,null,null,null,null,null,"2016-05-16",null,null,null,null,null,null,129,null,null,null,14.8,"NO SATISFACTORIO",null,null,null,null,null,null,null,null,null,null,null,null,null,null,null,null,null,null,null,null,null,null,null,null,51874235,"CORDERO","GONZÁLEZ","AIXA"," -","Oficina de Tecnología e Informática","- Grupo de Trabajo de Gestión de Información y Proyectos Informáticos","Oficina de Tecnología e Informática - Grupo de Trabajo de Gestión de Información y Proyectos Informáticos","Profesional Universitario (E)","PROFESIONAL",2044,"07"]
["Profesional de Gestión Institucional",null,null,null,null,null,null,null,null,null,null,null,null,null,null,"2016-05-17",null,null,null,null,null,null,130,null,null,null,14.9,"NO SATISFACTORIO",null,null,null,null,null,null,null,null,null,null,null,null,null,null,null,null,null,null,null,null,null,null,null,null,79428584,"CORDOBA","AVELLANEDA","NESTOR","JAVIER","Oficina de Servicios al Consumidor y de Apoyo Empresarial","- Grupo de Trabajo de Atención al Ciudadano","Oficina de Servicios al Consumidor y de Apoyo Empresarial - Grupo de Trabajo de Atención al Ciudadano","Técnico Administrativo (Prov)","TECNICO",3124,11]
["Profesional Especializado",null,null,null,null,null,null,null,null,null,null,null,null,null,null,"2016-05-18",null,null,null,null,null,null,131,null,null,null,15,"NO SATISFACTORIO",null,null,null,null,null,null,null,null,null,null,null,null,null,null,null,null,null,null,null,null,null,null,null,null,19255600,"CÓRDOBA","CHIRIVI","FABIO","EDGAR","Dirección Administrativa","- Grupo de Trabajo de Gestión Documental y Recursos Físicos","Dirección Administrativa - Grupo de Trabajo de Gestión Documental y Recursos Físicos","Profesional Especializado (E)","PROFESIONAL",2028,17]
["Profesional Especializado Area de la Salud",null,null,null,null,null,null,null,null,null,null,null,null,null,null,"2016-05-19",null,null,null,null,null,null,132,null,null,null,15.1,"NO SATISFACTORIO",null,null,null,null,null,null,null,null,null,null,null,null,null,null,null,null,null,null,null,null,null,null,null,null,1085285119,"CORDOBA","ENRIQUEZ","KATHERINE"," -","Dirección de Signos Distintivos","- Grupo de Trabajo de Forma","Dirección de Signos Distintivos - Grupo de Trabajo de Forma","Profesional Universitario (Prov)","PROFESIONAL",2044,"01"]
["Profesional Universitario",null,null,null,null,null,null,null,null,null,null,null,null,null,null,"2016-05-20",null,null,null,null,null,null,133,null,null,null,15.2,"NO SATISFACTORIO",null,null,null,null,null,null,null,null,null,null,null,null,null,null,null,null,null,null,null,null,null,null,null,null,41634019,"CORENA","GARCÉS","SARA","JOSEFINA","Dirección Administrativa","- Grupo de Trabajo de Gestión Documental y Recursos Físicos","Dirección Administrativa - Grupo de Trabajo de Gestión Documental y Recursos Físicos","Técnico Administrativo (E)","TECNICO",3124,11]
["Profesional Universitario Area de la Salud",null,null,null,null,null,null,null,null,null,null,null,null,null,null,"2016-05-21",null,null,null,null,null,null,134,null,null,null,15.3,"NO SATISFACTORIO",null,null,null,null,null,null,null,null,null,null,null,null,null,null,null,null,null,null,null,null,null,null,null,null,53118725,"CORONA","MIRANDA","PAOLA","ADRIANA","Secretaría General",null,"Secretaría General ","Profesional Universitario (Prov)","PROFESIONAL",2044,"05"]
["Registrador Delegado",null,null,null,null,null,null,null,null,null,null,null,null,null,null,"2016-05-22",null,null,null,null,null,null,135,null,null,null,15.4,"NO SATISFACTORIO",null,null,null,null,null,null,null,null,null,null,null,null,null,null,null,null,null,null,null,null,null,null,null,null,79430096,"CORRALES","ORTIZ","JOSÉ","LUIS","Despacho del Superintendente Delegado para Asuntos Jurisdiccionales","","Despacho del Superintendente Delegado para Asuntos Jurisdiccionales ","Conductor Mecánico (E)","ASISTENCIAL",4103,11]
["Registrador Seccional",null,null,null,null,null,null,null,null,null,null,null,null,null,null,"2016-05-23",null,null,null,null,null,null,136,null,null,null,15.5,"NO SATISFACTORIO",null,null,null,null,null,null,null,null,null,null,null,null,null,null,null,null,null,null,null,null,null,null,null,null,1016017467,"CORRALES","VEGA","EDWIN","LEONARDO","Despacho del Superintendente Delegado para Asuntos Jurisdiccionales","- Grupo de Trabajo de Secretaría","Despacho del Superintendente Delegado para Asuntos Jurisdiccionales - Grupo de Trabajo de Secretaría","Auxiliar Administrativo (Prov)","ASISTENCIAL",4044,"08"]
["Representante del Ministro de Educación ante Entidad Territorial",null,null,null,null,null,null,null,null,null,null,null,null,null,null,"2016-05-24",null,null,null,null,null,null,137,null,null,null,15.6,"NO SATISFACTORIO",null,null,null,null,null,null,null,null,null,null,null,null,null,null,null,null,null,null,null,null,null,null,null,null,51734428,"CORREA","VEGA","LUCILA"," -","Oficina de Servicios al Consumidor y de Apoyo Empresarial","- Grupo de Trabajo de Atención al Ciudadano","Oficina de Servicios al Consumidor y de Apoyo Empresarial - Grupo de Trabajo de Atención al Ciudadano","Profesional Universitario (Prov)","PROFESIONAL",2044,"01"]
["Restaurador o Museólogo o Curador",null,null,null,null,null,null,null,null,null,null,null,null,null,null,"2016-05-25",null,null,null,null,null,null,138,null,null,null,15.7,"NO SATISFACTORIO",null,null,null,null,null,null,null,null,null,null,null,null,null,null,null,null,null,null,null,null,null,null,null,null,1010172728,"CORTÉS","GARZÓN","LUISA","FERNANDA","Dirección de Investigaciones de Protección al Consumidor",null,"Dirección de Investigaciones de Protección al Consumidor ","Profesional Universitario (Prov)","PROFESIONAL",2044,"07"]
["Secretario de Facultad",null,null,null,null,null,null,null,null,null,null,null,null,null,null,"2016-05-26",null,null,null,null,null,null,139,null,null,null,15.8,"NO SATISFACTORIO",null,null,null,null,null,null,null,null,null,null,null,null,null,null,null,null,null,null,null,null,null,null,null,null,52036610,"CORTÉS","MARTÍNEZ","MARYI"," -","Secretaría General","- Grupo de Trabajo de Talento Humano","Secretaría General - Grupo de Trabajo de Talento Humano","Profesional Universitario (E)","PROFESIONAL",2044,10]
["Secretario Comercial I",null,null,null,null,null,null,null,null,null,null,null,null,null,null,"2016-05-27",null,null,null,null,null,null,140,null,null,null,15.9,"NO SATISFACTORIO",null,null,null,null,null,null,null,null,null,null,null,null,null,null,null,null,null,null,null,null,null,null,null,null,20964948,"CORTÉS","MOYA","MARTHA","ISABEL","Dirección Financiera",null,"Dirección Financiera ","Profesional Universitario (Prov)","PROFESIONAL",2044,"01"]
["Secretario Comercial II",null,null,null,null,null,null,null,null,null,null,null,null,null,null,"2016-05-28",null,null,null,null,null,null,141,null,null,null,16,"NO SATISFACTORIO",null,null,null,null,null,null,null,null,null,null,null,null,null,null,null,null,null,null,null,null,null,null,null,null,79340572,"CORTÉS","RAMÍREZ","REYES","DANIEL","Secretaría General","- Grupo de Trabajo de Notificaciones y Certificaciones","Secretaría General - Grupo de Trabajo de Notificaciones y Certificaciones","Auxiliar Administrativo (E)","ASISTENCIAL",4044,11]
["Segundo Secretario de Relaciones Exteriores",null,null,null,null,null,null,null,null,null,null,null,null,null,null,"2016-05-29",null,null,null,null,null,null,142,null,null,null,16.100000000000001,"NO SATISFACTORIO",null,null,null,null,null,null,null,null,null,null,null,null,null,null,null,null,null,null,null,null,null,null,null,null,80035465,"COY","QUINTERO","ALEJANDRO"," -","Dirección de Signos Distintivos","- Grupo de Trabajo de Fondo","Dirección de Signos Distintivos - Grupo de Trabajo de Fondo","Profesional Universitario (Prov)","PROFESIONAL",2044,"03"]
["Subdirector de Establecimiento Carcelario",null,null,null,null,null,null,null,null,null,null,null,null,null,null,"2016-05-30",null,null,null,null,null,null,143,null,null,null,16.2,"NO SATISFACTORIO",null,null,null,null,null,null,null,null,null,null,null,null,null,null,null,null,null,null,null,null,null,null,null,null,1032363359,"CRESPO","CARDENAS","SANDRA","CAROLINA","Dirección de Nuevas Creaciones","- Grupo de Trabajo de Ciencias Farmacéuticas y Biológicas","Dirección de Nuevas Creaciones - Grupo de Trabajo de Ciencias Farmacéuticas y Biológicas","Profesional Universitario (Prov)","PROFESIONAL",2044,"09"]
["Tercer Secretario de Relaciones Exteriores",null,null,null,null,null,null,null,null,null,null,null,null,null,null,"2016-05-31",null,null,null,null,null,null,144,null,null,null,16.3,"NO SATISFACTORIO",null,null,null,null,null,null,null,null,null,null,null,null,null,null,null,null,null,null,null,null,null,null,null,null,1032362387,"CRUZ","PINZON","LILIANA"," -","Despacho del Superintendente","- Grupo de Trabajo de Integraciones Empresariales","Despacho del Superintendente - Grupo de Trabajo de Integraciones Empresariales","Profesional Especializado ","PROFESIONAL",2028,17]
["Analista de Sistemas",null,null,null,null,null,null,null,null,null,null,null,null,null,null,"2016-06-01",null,null,null,null,null,null,145,null,null,null,16.399999999999999,"NO SATISFACTORIO",null,null,null,null,null,null,null,null,null,null,null,null,null,null,null,null,null,null,null,null,null,null,null,null,52282580,"CRUZ","SARMIENTO","LIZ","FRANCY","Dirección Financiera",null,"Dirección Financiera ","Profesional Universitario (Prov)","PROFESIONAL",2044,"09"]
["Auxiliar de Escena",null,null,null,null,null,null,null,null,null,null,null,null,null,null,"2016-06-02",null,null,null,null,null,null,146,null,null,null,16.5,"NO SATISFACTORIO",null,null,null,null,null,null,null,null,null,null,null,null,null,null,null,null,null,null,null,null,null,null,null,null,79818272,"CUESTA","TAUTIVA","LUIS","EDUAR","Oficina de Tecnología e Informática","- Grupo de Trabajo de Sistemas de Información","Oficina de Tecnología e Informática - Grupo de Trabajo de Sistemas de Información","Técnico Administrativo (Prov)","TECNICO",3124,11]
["Auxiliar de Pronóstico",null,null,null,null,null,null,null,null,null,null,null,null,null,null,"2016-06-03",null,null,null,null,null,null,147,null,null,null,16.600000000000001,"NO SATISFACTORIO",null,null,null,null,null,null,null,null,null,null,null,null,null,null,null,null,null,null,null,null,null,null,null,null,19342284,"CUESTAS","DÍAZ","NESTOR","HENRY","Despacho del Superintendente Delegado para Asuntos Jurisdiccionales","- Grupo de Trabajo de Secretaría","Despacho del Superintendente Delegado para Asuntos Jurisdiccionales - Grupo de Trabajo de Secretaría","Técnico Administrativo (Prov)","TECNICO",3124,11]
["Auxiliar de Técnico",null,null,null,null,null,null,null,null,null,null,null,null,null,null,"2016-06-04",null,null,null,null,null,null,148,null,null,null,16.7,"NO SATISFACTORIO",null,null,null,null,null,null,null,null,null,null,null,null,null,null,null,null,null,null,null,null,null,null,null,null,52781891,"CUEVAS","MEJIA","MÓNICA","ANDREA","Oficina de Servicios al Consumidor y de Apoyo Empresarial",null,"Oficina de Servicios al Consumidor y de Apoyo Empresarial ","Profesional Universitario (Prov)","PROFESIONAL",2044,"05"]
["Dactiloscopista",null,null,null,null,null,null,null,null,null,null,null,null,null,null,"2016-06-05",null,null,null,null,null,null,149,null,null,null,16.8,"NO SATISFACTORIO",null,null,null,null,null,null,null,null,null,null,null,null,null,null,null,null,null,null,null,null,null,null,null,null,7687224,"DANIELS","JARAMILLO","DIEGO","MAURICIO","Dirección de Signos Distintivos","- Grupo de Trabajo de Registro","Dirección de Signos Distintivos - Grupo de Trabajo de Registro","Técnico Administrativo (Prov)","TECNICO",3124,11]
["Tecnico",null,null,null,null,null,null,null,null,null,null,null,null,null,null,"2016-06-06",null,null,null,null,null,null,150,null,null,"SIETE",16.899999999999999,"NO SATISFACTORIO",null,null,null,null,null,null,null,null,null,null,null,null,null,null,null,null,null,null,null,null,null,null,null,null,20774379,"DELGADILLO","RODRÍGUEZ","BRILLITT","PILAR","Dirección de Signos Distintivos","- Grupo de Trabajo de Oposiciones y Cancelaciones","Dirección de Signos Distintivos - Grupo de Trabajo de Oposiciones y Cancelaciones","Secretario (Prov)","ASISTENCIAL",4178,10]
["Especialista Primero",null,null,null,null,null,null,null,null,null,null,null,null,null,null,"2016-06-07",null,null,null,null,null,null,151,null,null,null,17,"NO SATISFACTORIO",null,null,null,null,null,null,null,null,null,null,null,null,null,null,null,null,null,null,null,null,null,null,null,null,1031123536,"DELGADO","MONTES","RICARDO","DE JESÚS","Oficina de Tecnología e Informática","- Grupo de Trabajo de Sistemas de Información","Oficina de Tecnología e Informática - Grupo de Trabajo de Sistemas de Información","Profesional Universitario (Prov)","PROFESIONAL",2044,"07"]
["Especialista Segundo","ASESOR",null,null,null,null,null,null,null,null,null,null,null,null,null,"2016-06-08",null,null,null,null,null,null,152,null,null,null,17.100000000000001,"NO SATISFACTORIO",null,null,null,null,null,null,null,null,null,null,null,null,null,null,null,null,null,null,null,null,null,null,null,null,46682706,"DIAZ","ALVARADO","DEYANIRA"," -","Dirección de Cámaras de Comercio","- Grupo de Trabajo de Vigilancia de las Cámaras de Comercio y a los Comerciantes","Dirección de Cámaras de Comercio - Grupo de Trabajo de Vigilancia de las Cámaras de Comercio y a los Comerciantes","Profesional Universitario (Prov)","PROFESIONAL",2044,"01"]
["Especialista Tercero","Orientación a resultados",null,null,null,null,null,null,null,null,null,null,null,null,null,"2016-06-09",null,null,null,null,null,null,153,null,null,null,17.2,"NO SATISFACTORIO",null,null,null,null,null,null,null,null,null,null,null,null,null,null,null,null,null,null,null,null,null,null,null,null,16681370,"DÍAZ","BEDÓN","TOBIAS","ELIÉCER","Dirección de Investigaciones de Protección al Consumidor","","Dirección de Investigaciones de Protección al Consumidor ","Profesional Especializado (E)","PROFESIONAL",2028,13]
["Especialista Cuarto","Orientación al usuario y al ciudadano",null,null,null,null,null,null,null,null,null,null,null,null,null,"2016-06-10",null,null,null,null,null,null,154,null,null,null,17.3,"NO SATISFACTORIO",null,null,null,null,null,null,null,null,null,null,null,null,null,null,null,null,null,null,null,null,null,null,null,null,51629510,"DÍAZ","FONSECA","MARÍA","DEL CARMEN","Oficina Asesora de Planeación",null,"Oficina Asesora de Planeación ","Profesional Universitario (E)","PROFESIONAL",2044,10]
["Especialista Quinto","Transparencia",null,null,null,null,null,null,null,null,null,null,null,null,null,"2016-06-11",null,null,null,null,null,null,155,null,null,null,17.399999999999999,"NO SATISFACTORIO",null,null,null,null,null,null,null,null,null,null,null,null,null,null,null,null,null,null,null,null,null,null,null,null,7187380,"DÍAZ","GARZÓN","RONALD","ANDRÉS","Dirección de Investigación de Protección de Datos Personales","- Grupo de Trabajo de Habeas Data","Dirección de Investigación de Protección de Datos Personales - Grupo de Trabajo de Habeas Data","Técnico Administrativo (Prov)","TECNICO",3124,11]
["Especialista Sexto","Compromiso con la Organización",null,null,null,null,null,null,null,null,null,null,null,null,null,"2016-06-12",null,null,null,null,null,null,156,null,null,null,17.5,"NO SATISFACTORIO",null,null,null,null,null,null,null,null,null,null,null,null,null,null,null,null,null,null,null,null,null,null,null,null,51879797,"DÍAZ","PEÑA","MARLENY"," -","Dirección de Signos Distintivos","- Grupo de Trabajo de Forma","Dirección de Signos Distintivos - Grupo de Trabajo de Forma","Profesional Universitario (Prov)","PROFESIONAL",2044,"03"]
["Instructor","Experticia profesional (Nivel Asesor)",null,null,null,null,null,null,null,null,null,null,null,null,null,"2016-06-13",null,null,null,null,null,null,157,null,null,null,17.600000000000001,"NO SATISFACTORIO",null,null,null,null,null,null,null,null,null,null,null,null,null,null,null,null,null,null,null,null,null,null,null,null,52839143,"DÍAZ","PIRAZÁN","SONIA","ANDREA","Dirección de Nuevas Creaciones","- Grupo de Trabajo del Sector de Ingenierías","Dirección de Nuevas Creaciones - Grupo de Trabajo del Sector de Ingenierías","Profesional Universitario (Prov)","PROFESIONAL",2044,"05"]
["Instrumentador Quirúrgico","Conocimiento del entorno",null,null,null,null,null,null,null,null,null,null,null,null,null,"2016-06-14",null,null,null,null,null,null,158,null,null,null,17.7,"NO SATISFACTORIO",null,null,null,null,null,null,null,null,null,null,null,null,null,null,null,null,null,null,null,null,null,null,null,null,1020751662,"DÍAZ","SUÁREZ","MARÍA","MERCEDES","Dirección de Signos Distintivos","- Grupo de Trabajo de Fondo","Dirección de Signos Distintivos - Grupo de Trabajo de Fondo","Profesional Universitario (Prov)","PROFESIONAL",2044,"01"]
["Observador de Superficie","Construcción de relaciones",null,null,null,null,null,null,null,null,null,null,null,null,null,"2016-06-15",null,null,null,null,null,null,159,null,null,null,17.8,"NO SATISFACTORIO",null,null,null,null,null,null,null,null,null,null,null,null,null,null,null,null,null,null,null,null,null,null,null,null,1128047454,"DIAZ","SUAZA","FELIPE","AUGUSTO","Despacho del Superintendente Delegado para la Protección de la Competencia","- Grupo de Trabajo de Protección y Promoción de la Competencia","Despacho del Superintendente Delegado para la Protección de la Competencia - Grupo de Trabajo de Protección y Promoción de la Competencia","Profesional Universitario (Prov)","PROFESIONAL",2044,10]
["Oficial de Catastro","Iniciativa",null,null,null,null,null,null,null,null,null,null,null,null,null,"2016-06-16",null,null,null,null,null,null,160,null,null,null,17.899999999999999,"NO SATISFACTORIO",null,null,null,null,null,null,null,null,null,null,null,null,null,null,null,null,null,null,null,null,null,null,null,null,33081428,"DÍAZ","VILLACOB","ISABEL","CRISTINA","Secretaría General","- Grupo de Trabajo de Talento Humano","Secretaría General - Grupo de Trabajo de Talento Humano","Profesional Especializado (E)","PROFESIONAL",2028,13]
["Pronosticador",null,null,null,null,null,null,null,null,null,null,null,null,null,null,"2016-06-17",null,null,null,null,null,null,161,null,null,null,18,"NO SATISFACTORIO",null,null,null,null,null,null,null,null,null,null,null,null,null,null,null,null,null,null,null,null,null,null,null,null,24571357,"DOMÍNGUEZ","GIRALDO","EDILMA"," -","Despacho del Superintendente Delegado para la Protección de la Competencia","- Grupo de Trabajo de Prácticas Restrictivas de la Competencia","Despacho del Superintendente Delegado para la Protección de la Competencia - Grupo de Trabajo de Prácticas Restrictivas de la Competencia","Profesional Especializado (E)","PROFESIONAL",2028,17]
["Radiosondista","PROFESIONAL",null,null,null,null,null,null,null,null,null,null,null,null,null,"2016-06-18",null,null,null,null,null,null,162,null,null,null,18.100000000000001,"NO SATISFACTORIO",null,null,null,null,null,null,null,null,null,null,null,null,null,null,null,null,null,null,null,null,null,null,null,null,80110145,"DONCEL","BARÓN","JAMER","ALEXANDER","Despacho del Superintendente",null,"Despacho del Superintendente ","Conductor Mecánico","ASISTENCIAL",4103,13]
["Técnico","Orientación a resultados",null,null,null,null,null,null,null,null,null,null,null,null,null,"2016-06-19",null,null,null,null,null,null,163,null,null,null,18.2,"NO SATISFACTORIO",null,null,null,null,null,null,null,null,null,null,null,null,null,null,null,null,null,null,null,null,null,null,null,null,1026264490,"DONCEL","BARÓN","YANIRA","SOLAY","Dirección de Investigaciones para el Control y Verificación de Reglamentos Técnicos y Metrología Legal","","Dirección de Investigaciones para el Control y Verificación de Reglamentos Técnicos y Metrología Legal ","Auxiliar Administrativo (Prov)","ASISTENCIAL",4044,11]
["Técnico Administrativo","Orientación al usuario y al ciudadano",null,null,null,null,null,null,null,null,null,null,null,null,null,"2016-06-20",null,null,null,null,null,null,164,null,null,null,18.3,"NO SATISFACTORIO",null,null,null,null,null,null,null,null,null,null,null,null,null,null,null,null,null,null,null,null,null,null,null,null,80543078,"DUARTE","LEGUIZAMÓN","EDGAR","MAURICIO","Despacho del Superintendente Delegado para Asuntos Jurisdiccionales","- Grupo de Trabajo de Competencia Desleal y Propiedad Industrial","Despacho del Superintendente Delegado para Asuntos Jurisdiccionales - Grupo de Trabajo de Competencia Desleal y Propiedad Industrial","Profesional Universitario (Prov)","PROFESIONAL",2044,11]
["Técnico Area Salud","Transparencia",null,null,null,null,null,null,null,null,null,null,null,null,null,"2016-06-21",null,null,null,null,null,null,165,null,null,null,18.399999999999999,"NO SATISFACTORIO",null,null,null,null,null,null,null,null,null,null,null,null,null,null,null,null,null,null,null,null,null,null,null,null,52023676,"DUARTE","PEÑUELA","MARÍA","DEL PILAR","Dirección de Signos Distintivos","- Grupo de Trabajo de Fondo","Dirección de Signos Distintivos - Grupo de Trabajo de Fondo","Profesional Universitario (Prov)","PROFESIONAL",2044,"09"]
["Técnico de Servicios Asistenciales","Compromiso con la Organización",null,null,null,null,null,null,null,null,null,null,null,null,null,"2016-06-22",null,null,null,null,null,null,166,null,null,null,18.5,"NO SATISFACTORIO",null,null,null,null,null,null,null,null,null,null,null,null,null,null,null,null,null,null,null,null,null,null,null,null,79878355,"DUQUE","CALLE","HÉCTOR","FABIO","Dirección de Cámaras de Comercio",null,"Dirección de Cámaras de Comercio ","Secretario (Prov)","ASISTENCIAL",4178,13]
["Técnico Operativo","Aprendizaje Continuo",null,null,null,null,null,null,null,null,null,null,null,null,null,"2016-06-23",null,null,null,null,null,null,167,null,null,null,18.600000000000001,"NO SATISFACTORIO",null,null,null,null,null,null,null,null,null,null,null,null,null,null,null,null,null,null,null,null,null,null,null,null,52027843,"DURÁN","CASTRO","OLGA","MARÍA","Oficina de Servicios al Consumidor y de Apoyo Empresarial","","Oficina de Servicios al Consumidor y de Apoyo Empresarial ","Secretario (Prov)","ASISTENCIAL",4178,"08"]
["Topógrafo","Experticia profesional (Nivel profesional)",null,null,null,null,null,null,null,null,null,null,null,null,null,"2016-06-24",null,null,null,null,null,null,168,null,null,null,18.7,"NO SATISFACTORIO",null,null,null,null,null,null,null,null,null,null,null,null,null,null,null,null,null,null,null,null,null,null,null,null,52114504,"DURAN","JANET","LILIANA","PATRICIA","Dirección de Cámaras de Comercio","- Grupo de Trabajo de Vigilancia de las Cámaras de Comercio y a los Comerciantes","Dirección de Cámaras de Comercio - Grupo de Trabajo de Vigilancia de las Cámaras de Comercio y a los Comerciantes","Profesional Especializado (Prov)","PROFESIONAL",2028,13]
["Topógrafo Tecnólogo","Trabajo en equipo y Colaboración",null,null,null,null,null,null,null,null,null,null,null,null,null,"2016-06-25",null,null,null,null,null,null,169,null,null,null,18.8,"NO SATISFACTORIO",null,null,null,null,null,null,null,null,null,null,null,null,null,null,null,null,null,null,null,null,null,null,null,null,41958187,"ECHEVERRY","SALINAS","NICKY","LAURA","Dirección Administrativa","- Grupo de Trabajo de Contratación","Dirección Administrativa - Grupo de Trabajo de Contratación","Profesional Universitario (Prov)","PROFESIONAL",2044,10]
["Adjunto Jefe","Creatividad e Innovación (Nivel profesional)",null,null,null,null,null,null,null,null,null,null,null,null,null,"2016-06-26",null,null,null,null,null,null,170,null,null,null,18.899999999999999,"NO SATISFACTORIO",null,null,null,null,null,null,null,null,null,null,null,null,null,null,null,null,null,null,null,null,null,null,null,null,1017191551,"ESCOBAR","ORREGO","HÉCTOR","DAVID","Secretaría General","- Grupo de  Control Disciplinario Interno","Secretaría General - Grupo de  Control Disciplinario Interno","Profesional Universitario (Prov)","PROFESIONAL",2044,"01"]
["Adjunto Intendente","Liderazgo de Grupos de Trabajo",null,null,null,null,null,null,null,null,null,null,null,null,null,"2016-06-27",null,null,null,null,null,null,171,null,null,null,19,"NO SATISFACTORIO",null,null,null,null,null,null,null,null,null,null,null,null,null,null,null,null,null,null,null,null,null,null,null,null,51743543,"ESCOVAR","KOUSEN","MARTHA","MERCEDES","Oficina de Tecnología e Informática","- Grupo de Trabajo de Sistemas de Información","Oficina de Tecnología e Informática - Grupo de Trabajo de Sistemas de Información","Técnico Administrativo","TECNICO",3124,15]
["Adjunto Mayor","Toma de decisiones",null,null,null,null,null,null,null,null,null,null,null,null,null,"2016-06-28",null,null,null,null,null,null,172,null,null,null,19.100000000000001,"NO SATISFACTORIO",null,null,null,null,null,null,null,null,null,null,null,null,null,null,null,null,null,null,null,null,null,null,null,null,1130612436,"ESPINAL","ESPINAL","ESTEFANIA"," -","Despacho del Superintendente Delegado para la Protección de la Competencia","- Grupo de Trabajo de Protección y Promoción de la Competencia","Despacho del Superintendente Delegado para la Protección de la Competencia - Grupo de Trabajo de Protección y Promoción de la Competencia","Profesional Universitario (Prov)","PROFESIONAL",2044,"05"]
["Adjunto Especial",null,null,null,null,null,null,null,null,null,null,null,null,null,null,"2016-06-29",null,null,null,null,null,null,173,null,null,null,19.2,"NO SATISFACTORIO",null,null,null,null,null,null,null,null,null,null,null,null,null,null,null,null,null,null,null,null,null,null,null,null,79435867,"ESPINOSA","GÓMEZ","VICTOR","MANUEL","Dirección de Investigaciones para el Control y Verificación de Reglamentos Técnicos y Metrología Legal","-Grupo de Trabajo de Inspección y Vigilancia de Reglamentos Técnicos","Dirección de Investigaciones para el Control y Verificación de Reglamentos Técnicos y Metrología Legal -Grupo de Trabajo de Inspección y Vigilancia de Reglamentos Técnicos","Profesional Universitario (Prov)","PROFESIONAL",2044,11]
["Adjunto Primero","TECNICO",null,null,null,null,null,null,null,null,null,null,null,null,null,"2016-06-30",null,null,null,null,null,null,174,null,null,null,19.3,"NO SATISFACTORIO",null,null,null,null,null,null,null,null,null,null,null,null,null,null,null,null,null,null,null,null,null,null,null,null,52179244,"ESPITIA","ROJAS","GLADYS","ADRIANA","Dirección de Signos Distintivos","- Grupo de Trabajo de Fondo","Dirección de Signos Distintivos - Grupo de Trabajo de Fondo","Secretario (E)","ASISTENCIAL",4178,13]
["Adjunto Segundo","Orientación a resultados",null,null,null,null,null,null,null,null,null,null,null,null,null,"2016-07-01",null,null,null,null,null,null,175,null,null,null,19.399999999999999,"NO SATISFACTORIO",null,null,null,null,null,null,null,null,null,null,null,null,null,null,null,null,null,null,null,null,null,null,null,null,52972546,"ESPITIA","ROJAS","LYNDA","CAROLINA","Despacho del Superintendente ","- Grupo de Trabajo de Apoyo a la Red Nacional de Protección al Consumidor","Despacho del Superintendente  - Grupo de Trabajo de Apoyo a la Red Nacional de Protección al Consumidor","Profesional Universitario (Prov)","PROFESIONAL",2044,"01"]
["Adjunto Tercero","Orientación al usuario y al ciudadano",null,null,null,null,null,null,null,null,null,null,null,null,null,"2016-07-02",null,null,null,null,null,null,176,null,null,"OCHO",19.5,"NO SATISFACTORIO",null,null,null,null,null,null,null,null,null,null,null,null,null,null,null,null,null,null,null,null,null,null,null,null,1023873205,"ESTEPA","TOZCANO","JESÚS","LEONARDO","Despacho del Superintendente Delegado para la Propiedad Industrial",null,"Despacho del Superintendente Delegado para la Propiedad Industrial ","Profesional Universitario (Prov)","PROFESIONAL",2044,"01"]
["Adjunto Cuarto","Transparencia",null,null,null,null,null,null,null,null,null,null,null,null,null,"2016-07-03",null,null,null,null,null,null,177,null,null,null,19.600000000000001,"NO SATISFACTORIO",null,null,null,null,null,null,null,null,null,null,null,null,null,null,null,null,null,null,null,null,null,null,null,null,79318876,"ESTRADA","ENCISO","LUIS","ARMANDO","Despacho del Superintendente Delegado para la Protección de la Competencia","- Grupo de Trabajo de Protección y Promoción de la Competencia","Despacho del Superintendente Delegado para la Protección de la Competencia - Grupo de Trabajo de Protección y Promoción de la Competencia","Profesional Universitario (E)","PROFESIONAL",2044,"05"]
["Adjunto Quinto","Compromiso con la Organización",null,null,null,null,null,null,null,null,null,null,null,null,null,"2016-07-04",null,null,null,null,null,null,178,null,null,null,19.7,"NO SATISFACTORIO",null,null,null,null,null,null,null,null,null,null,null,null,null,null,null,null,null,null,null,null,null,null,null,null,1022324150,"FANDIÑO","VERGARA","MARTHA","LILIANA","Despacho del Superintendente Delegado para la Protección de la Competencia","- Grupo de Trabajo Interdisciplinario de Colusiones","Despacho del Superintendente Delegado para la Protección de la Competencia - Grupo de Trabajo Interdisciplinario de Colusiones","Profesional Universitario (Prov)","PROFESIONAL",2044,"09"]
["Auxiliar Administrativo","Experticia Técnica",null,null,null,null,null,null,null,null,null,null,null,null,null,"2016-07-05",null,null,null,null,null,null,179,null,null,null,19.8,"NO SATISFACTORIO",null,null,null,null,null,null,null,null,null,null,null,null,null,null,null,null,null,null,null,null,null,null,null,null,1018406168,"FARFAN","MURGAS","MARIA","DEL PILAR","Dirección de Signos Distintivos","- Grupo de Trabajo de Fondo","Dirección de Signos Distintivos - Grupo de Trabajo de Fondo","Profesional Universitario (Prov)","PROFESIONAL",2044,"01"]
["Auxiliar Area Salud","Trabajo en equipo",null,null,null,null,null,null,null,null,null,null,null,null,null,"2016-07-06",null,null,null,null,null,null,180,null,null,null,19.899999999999999,"NO SATISFACTORIO",null,null,null,null,null,null,null,null,null,null,null,null,null,null,null,null,null,null,null,null,null,null,null,null,74326993,"FERNÁNDEZ","FERNÁNDEZ","FREDY","ORLANDO","Despacho del Superintendente Delegado para la Protección de la Competencia","- Grupo de Trabajo de Prácticas Restrictivas de la Competencia","Despacho del Superintendente Delegado para la Protección de la Competencia - Grupo de Trabajo de Prácticas Restrictivas de la Competencia","Profesional Universitario (Prov)","PROFESIONAL",2044,"09"]
["Auxiliar Bilingüe","Creatividad e innovación (Nivel técnico)",null,null,null,null,null,null,null,null,null,null,null,null,null,"2016-07-07",null,null,null,null,null,null,181,null,null,null,20,"NO SATISFACTORIO",null,null,null,null,null,null,null,null,null,null,null,null,null,null,null,null,null,null,null,null,null,null,null,null,13255132,"FERREIRA","BALLESTEROS","HÉCTOR"," -","Dirección Administrativa","- Grupo de Trabajo de Gestión Documental y Recursos Físicos","Dirección Administrativa - Grupo de Trabajo de Gestión Documental y Recursos Físicos","Técnico Administrativo","TECNICO",3124,11]
["Auxiliar de Servicios Asistenciales",null,null,null,null,null,null,null,null,null,null,null,null,null,null,"2016-07-08",null,null,null,null,null,null,182,null,null,null,20.100000000000001,"NO SATISFACTORIO",null,null,null,null,null,null,null,null,null,null,null,null,null,null,null,null,null,null,null,null,null,null,null,null,51588236,"FIGUEROA","GARCIA","ESPERANZA"," -","Dirección de Signos Distintivos","- Grupo de Trabajo de Forma","Dirección de Signos Distintivos - Grupo de Trabajo de Forma","Técnico Administrativo (E)","TECNICO",3124,11]
["Auxiliar de Servicios Generales","ASISTENCIAL",null,null,null,null,null,null,null,null,null,null,null,null,null,"2016-07-09",null,null,null,null,null,null,183,null,null,null,20.2,"NO SATISFACTORIO",null,null,null,null,null,null,null,null,null,null,null,null,null,null,null,null,null,null,null,null,null,null,null,null,1020760778,"FLECHAS","RODRÍGUEZ","STEPHANIE"," -","Despacho del Superintendente Delegado para la Protección de la Competencia","- Grupo de Trabajo de Prácticas Restrictivas de la Competencia","Despacho del Superintendente Delegado para la Protección de la Competencia - Grupo de Trabajo de Prácticas Restrictivas de la Competencia","Profesional Universitario (Prov)","PROFESIONAL",2044,"07"]
["Capitán de Prisiones","Orientación a resultados",null,null,null,null,null,null,null,null,null,null,null,null,null,"2016-07-10",null,null,null,null,null,null,184,null,null,null,20.3,"NO SATISFACTORIO",null,null,null,null,null,null,null,null,null,null,null,null,null,null,null,null,null,null,null,null,null,null,null,null,41770909,"FLÓREZ","CARMONA","SARA","PIEDAD","Oficina Asesora Jurídica","- Grupo de Trabajo de Cobro Coactivo","Oficina Asesora Jurídica - Grupo de Trabajo de Cobro Coactivo","Profesional Especializado (E)","PROFESIONAL",2028,13]
["Celador","Orientación al usuario y al ciudadano",null,null,null,null,null,null,null,null,null,null,null,null,null,"2016-07-11",null,null,null,null,null,null,185,null,null,null,20.399999999999999,"NO SATISFACTORIO",null,null,null,null,null,null,null,null,null,null,null,null,null,null,null,null,null,null,null,null,null,null,null,null,52819759,"FLÓREZ","CORONEL","ALBA","LUCRECIA","Oficina Asesora Jurídica","- Grupo de Trabajo de Cobro Coactivo","Oficina Asesora Jurídica - Grupo de Trabajo de Cobro Coactivo","Profesional Universitario (Prov)","PROFESIONAL",2044,11]
["Asistencial","Transparencia",null,null,null,null,null,null,null,null,null,null,null,null,null,"2016-07-12",null,null,null,null,null,null,186,null,null,null,20.5,"NO SATISFACTORIO",null,null,null,null,null,null,null,null,null,null,null,null,null,null,null,null,null,null,null,null,null,null,null,null,65589069,"FLORIAN","RODRIGUEZ","ESTEFANIA"," -","Secretaría General","- Grupo de Trabajo de Talento Humano",{"$f":"CONCATENATE(BF195,\" \",BG195)","v":"Secretaría General - Grupo de Trabajo de Talento Humano"},"Profesional Universitario (Prov)","PROFESIONAL",2044,"01"]
["Conductor Mecánico","Compromiso con la Organización",null,null,null,null,null,null,null,null,null,null,null,null,null,"2016-07-13",null,null,null,null,null,null,187,null,null,null,20.6,"NO SATISFACTORIO",null,null,null,null,null,null,null,null,null,null,null,null,null,null,null,null,null,null,null,null,null,null,null,null,79102884,"FONSECA","POVEDA","PEDRO","ORLANDO","Dirección de Signos Distintivos","- Grupo de Trabajo de Forma","Dirección de Signos Distintivos - Grupo de Trabajo de Forma","Profesional Universitario (E)","PROFESIONAL",2044,"09"]
["Distinguido","Manejo de la información",null,null,null,null,null,null,null,null,null,null,null,null,null,"2016-07-14",null,null,null,null,null,null,188,null,null,null,20.7,"NO SATISFACTORIO",null,null,null,null,null,null,null,null,null,null,null,null,null,null,null,null,null,null,null,null,null,null,null,null,80773850,"FORERO","GONZÁLEZ","JORGE","DIEGO","Despacho del Superintendente Delegado para la Protección de la Competencia","- Grupo de Trabajo Interdisciplinario de Colusiones","Despacho del Superintendente Delegado para la Protección de la Competencia - Grupo de Trabajo Interdisciplinario de Colusiones","Profesional Universitario (Prov)","PROFESIONAL",2044,10]
["Dragoneante","Adaptación al cambio",null,null,null,null,null,null,null,null,null,null,null,null,null,"2016-07-15",null,null,null,null,null,null,189,null,null,null,20.8,"NO SATISFACTORIO",null,null,null,null,null,null,null,null,null,null,null,null,null,null,null,null,null,null,null,null,null,null,null,null,65762623,"FORERO","SAÉNZ","LUZ","AMPARO","Dirección Administrativa","- Grupo de Trabajo de Gestión Documental y Recursos Físicos","Dirección Administrativa - Grupo de Trabajo de Gestión Documental y Recursos Físicos","Auxiliar de Servicios Generales (Prov)","ASISTENCIAL",4064,"05"]
["Ecónomo","Disciplina",null,null,null,null,null,null,null,null,null,null,null,null,null,"2016-07-16",null,null,null,null,null,null,190,null,null,null,20.9,"NO SATISFACTORIO",null,null,null,null,null,null,null,null,null,null,null,null,null,null,null,null,null,null,null,null,null,null,null,null,18471152,"FORONDA","OSORIO","JUAN","GABRIEL","Despacho del Superintendente Delegado para la Protección de la Competencia","- Grupo de Trabajo Interdisciplinario de Colusiones","Despacho del Superintendente Delegado para la Protección de la Competencia - Grupo de Trabajo Interdisciplinario de Colusiones","Profesional Universitario (Prov)","PROFESIONAL",2044,"07"]
["Enfermero Auxiliar","Relaciones Interpersonales",null,null,null,null,null,null,null,null,null,null,null,null,null,"2016-07-17",null,null,null,null,null,null,191,null,null,null,21,"NO SATISFACTORIO",null,null,null,null,null,null,null,null,null,null,null,null,null,null,null,null,null,null,null,null,null,null,null,null,1019016704,"FRANCO","MONCADA","LUIS","ENRIQUE","Dirección de Signos Distintivos",null,"Dirección de Signos Distintivos ","Técnico Administrativo (Prov)","TECNICO",3124,"07"]
["Inspector","Colaboración",null,null,null,null,null,null,null,null,null,null,null,null,null,"2016-07-18",null,null,null,null,null,null,192,null,null,null,21.1,"NO SATISFACTORIO",null,null,null,null,null,null,null,null,null,null,null,null,null,null,null,null,null,null,null,null,null,null,null,null,24620755,"FRANCO","PELÁEZ","LUZ","STELLA","Dirección de Signos Distintivos","- Grupo de Trabajo de Registro","Dirección de Signos Distintivos - Grupo de Trabajo de Registro","Secretario (E)","ASISTENCIAL",4178,13]
["Inspector Jefe",null,null,null,null,null,null,null,null,null,null,null,null,null,null,"2016-07-19",null,null,null,null,null,null,193,null,null,null,21.2,"NO SATISFACTORIO",null,null,null,null,null,null,null,null,null,null,null,null,null,null,null,null,null,null,null,null,null,null,null,null,1020716493,"FRANCO","VANEGAS","MARIO","ALEJANDRO","Despacho del Superintendente Delegado para la Protección de la Competencia","- Grupo de Trabajo Interdisciplinario de Colusiones","Despacho del Superintendente Delegado para la Protección de la Competencia - Grupo de Trabajo Interdisciplinario de Colusiones","Profesional Universitario (Prov)","PROFESIONAL",2044,"03"]
["Mayor de Prisiones",null,null,null,null,null,null,null,null,null,null,null,null,null,null,"2016-07-20",null,null,null,null,null,null,194,null,null,null,21.3,"NO SATISFACTORIO",null,null,null,null,null,null,null,null,null,null,null,null,null,null,null,null,null,null,null,null,null,null,null,null,79461941,"GALVIS","RAMÍREZ","GERMÁN"," -","Despacho del Superintendente Delegado para Asuntos Jurisdiccionales","- Grupo de Trabajo de Competencia Desleal y Propiedad Industrial","Despacho del Superintendente Delegado para Asuntos Jurisdiccionales - Grupo de Trabajo de Competencia Desleal y Propiedad Industrial","Técnico Administrativo (Prov)","TECNICO",3124,11]
["Operario",null,null,null,null,null,null,null,null,null,null,null,null,null,null,"2016-07-21",null,null,null,null,null,null,195,null,null,null,21.4,"NO SATISFACTORIO",null,null,null,null,null,null,null,null,null,null,null,null,null,null,null,null,null,null,null,null,null,null,null,null,1049611515,"GAMA","ROJAS","DIANA","CAROLINA","Despacho del Superintendente Delegado para la Protección de la Competencia","- Grupo de Trabajo de Integraciones Empresariales","Despacho del Superintendente Delegado para la Protección de la Competencia - Grupo de Trabajo de Integraciones Empresariales","Técnico Administrativo (Prov)","TECNICO",3124,"07"]
["Operario Calificado",null,null,null,null,null,null,null,null,null,null,null,null,null,null,"2016-07-22",null,null,null,null,null,null,196,null,null,null,21.5,"NO SATISFACTORIO",null,null,null,null,null,null,null,null,null,null,null,null,null,null,null,null,null,null,null,null,null,null,null,null,19268330,"GAMBA","MUÑOZ","EXCELINO"," -","Oficina Asesora de Planeación",null,"Oficina Asesora de Planeación ","Profesional Universitario (E)","PROFESIONAL",2044,11]
["Pagador",null,null,null,null,null,null,null,null,null,null,null,null,null,null,"2016-07-23",null,null,null,null,null,null,197,null,null,null,21.6,"NO SATISFACTORIO",null,null,null,null,null,null,null,null,null,null,null,null,null,null,null,null,null,null,null,null,null,null,null,null,52971258,"GAMBOA","GONZÁLEZ","DIANA","LICET","Dirección Administrativa","- Grupo de Trabajo de Gestión Documental y Recursos Físicos","Dirección Administrativa - Grupo de Trabajo de Gestión Documental y Recursos Físicos","Auxiliar Administrativo (Prov)","ASISTENCIAL",4044,"08"]
["Secretario",null,null,null,null,null,null,null,null,null,null,null,null,null,null,"2016-07-24",null,null,null,null,null,null,198,null,null,null,21.7,"NO SATISFACTORIO",null,null,null,null,null,null,null,null,null,null,null,null,null,null,null,null,null,null,null,null,null,null,null,null,52115617,"GAMBOA","NIÑO","ZAYDHA","JENNY","Secretaría General","- Grupo de Trabajo de Notificaciones y Certificaciones","Secretaría General - Grupo de Trabajo de Notificaciones y Certificaciones","Profesional Universitario (Prov)","PROFESIONAL",2044,"03"]
["Secretario Bilingüe",null,null,null,null,null,null,null,null,null,null,null,null,null,null,"2016-07-25",null,null,null,null,null,null,199,null,null,null,21.8,"NO SATISFACTORIO",null,null,null,null,null,null,null,null,null,null,null,null,null,null,null,null,null,null,null,null,null,null,null,null,9149236,"GANEM","GULFO","ANDRÉS","FERNANDO","Dirección de Investigaciones de Protección de Usuarios de Servicios de Comunicaciones","- Grupo de Trabajo de Supervisión, Control y Vigilancia de los Regímenes de Protección de Usuarios de Servicios de Comunicaciones","Dirección de Investigaciones de Protección de Usuarios de Servicios de Comunicaciones - Grupo de Trabajo de Supervisión, Control y Vigilancia de los Regímenes de Protección de Usuarios de Servicios de Comunicaciones","Profesional Universitario (Prov)","PROFESIONAL",2044,"07"]
["Secretario Ejecutivo",null,null,null,null,null,null,null,null,null,null,null,null,null,null,"2016-07-26",null,null,null,null,null,null,200,null,null,null,21.9,"NO SATISFACTORIO",null,null,null,null,null,null,null,null,null,null,null,null,null,null,null,null,null,null,null,null,null,null,null,null,1096186148,"GARCÉS","JIMÉNEZ","LUZ","DARY","Despacho del Superintendente Delegado para Asuntos Jurisdiccionales","- Grupo de Trabajo de Defensa del Consumidor","Despacho del Superintendente Delegado para Asuntos Jurisdiccionales - Grupo de Trabajo de Defensa del Consumidor","Profesional Universitario (Prov)","PROFESIONAL",2044,"07"]
["Secretario Ejecutivo del Despacho de Ministro o de Director de Departamento Administrativo",null,null,null,null,null,null,null,null,null,null,null,null,null,null,"2016-07-27",null,null,null,null,null,null,201,null,null,null,22,"NO SATISFACTORIO",null,null,null,null,null,null,null,null,null,null,null,null,null,null,null,null,null,null,null,null,null,null,null,null,39796379,"GARCÍA","ÁVILA","BETTY","AIDEÉ","Dirección de Signos Distintivos","- Grupo de Trabajo de Oposiciones y Cancelaciones","Dirección de Signos Distintivos - Grupo de Trabajo de Oposiciones y Cancelaciones","Secretario (E)","ASISTENCIAL",4178,13]
["Secretario Ejecutivo del Despacho del Viceministro o de Subdirector de Departamento Administrativo",null,null,null,null,null,null,null,null,null,null,null,null,null,null,"2016-07-28",null,null,null,null,null,null,202,null,null,"NUEVE",22.1,"NO SATISFACTORIO",null,null,null,null,null,null,null,null,null,null,null,null,null,null,null,null,null,null,null,null,null,null,null,null,10387093,"GARCÍA","CUERO","JAIR","FERNANDO","Secretaría General","- Grupo de Trabajo de Notificaciones y Certificaciones","Secretaría General - Grupo de Trabajo de Notificaciones y Certificaciones","Profesional Universitario (Prov)","PROFESIONAL",2044,"05"]
["Supervisor",null,null,null,null,null,null,null,null,null,null,null,null,null,null,"2016-07-29",null,null,null,null,null,null,203,null,null,null,22.2,"NO SATISFACTORIO",null,null,null,null,null,null,null,null,null,null,null,null,null,null,null,null,null,null,null,null,null,null,null,null,5530121,"GARCÍA","GARCIA","JESÚS","FERNEL","Despacho del Superintendente Delegado para la Propiedad Industrial","- Grupo de Trabajo de Vía Gubernativa","Despacho del Superintendente Delegado para la Propiedad Industrial - Grupo de Trabajo de Vía Gubernativa","Profesional Especializado (E)","PROFESIONAL",2028,13]
["Teniente de Prisiones",null,null,null,null,null,null,null,null,null,null,null,null,null,null,"2016-07-30",null,null,null,null,null,null,204,null,null,null,22.3,"NO SATISFACTORIO",null,null,null,null,null,null,null,null,null,null,null,null,null,null,null,null,null,null,null,null,null,null,null,null,52984502,"GARCÍA","GUTIERREZ","DIANA","CAROLINA","Secretaría General","- Grupo de Trabajo de Talento Humano","Secretaría General - Grupo de Trabajo de Talento Humano","Técnico Administrativo (Prov)","TECNICO",3124,"07"]
["Tesorero",null,null,null,null,null,null,null,null,null,null,null,null,null,null,"2016-07-31",null,null,null,null,null,null,205,null,null,null,22.4,"NO SATISFACTORIO",null,null,null,null,null,null,null,null,null,null,null,null,null,null,null,null,null,null,null,null,null,null,null,null,79301249,"GARCÍA","HERRERA","ANDRÉS"," -","Dirección de Investigaciones de Protección al Consumidor","- Grupo de Trabajo de Supervisión Empresarial y Seguridad de Producto","Dirección de Investigaciones de Protección al Consumidor - Grupo de Trabajo de Supervisión Empresarial y Seguridad de Producto","Profesional Universitario (Prov)","PROFESIONAL",2044,10]
[null,null,null,null,null,null,null,null,null,null,null,null,null,null,null,"2016-08-01",null,null,null,null,null,null,206,null,null,null,22.5,"NO SATISFACTORIO",null,null,null,null,null,null,null,null,null,null,null,null,null,null,null,null,null,null,null,null,null,null,null,null,52706359,"GARCÍA","MOLINA","CAROLINA"," -","Oficina Asesora Jurídica","","Oficina Asesora Jurídica ","Profesional Universitario (Prov)","PROFESIONAL",2044,"09"]
[null,null,null,null,null,null,null,null,null,null,null,null,null,null,null,"2016-08-02",null,null,null,null,null,null,207,null,null,null,22.6,"NO SATISFACTORIO",null,null,null,null,null,null,null,null,null,null,null,null,null,null,null,null,null,null,null,null,null,null,null,null,10006855,"GARCÍA","PINEDA","FELIPE"," -","Despacho del Superintendente","","Despacho del Superintendente ","Asesor","ASESOR",1020,14]
[null,null,null,null,null,null,null,null,null,null,null,null,null,null,null,"2016-08-03",null,null,null,null,null,null,208,null,null,null,22.7,"NO SATISFACTORIO",null,null,null,null,null,null,null,null,null,null,null,null,null,null,null,null,null,null,null,null,null,null,null,null,19307389,"GARCÍA","RAMÍREZ","RICARDO"," -","Oficina Asesora Jurídica","- Grupo de Trabajo de Cobro Coactivo","Oficina Asesora Jurídica - Grupo de Trabajo de Cobro Coactivo","Profesional Especializado (E)","PROFESIONAL",2028,19]
[null,null,null,null,null,null,null,null,null,null,null,null,null,null,null,"2016-08-04",null,null,null,null,null,null,209,null,null,null,22.8,"NO SATISFACTORIO",null,null,null,null,null,null,null,null,null,null,null,null,null,null,null,null,null,null,null,null,null,null,null,null,79317681,"GARCÍA","RANGEL","GONZALO"," -","Secretaría General","","Secretaría General ","Conductor Mecánico (Prov)","ASISTENCIAL",4103,13]
["Competencia","Definición de la competencia","Conductas asociadas",null,null,null,null,null,null,null,null,null,null,null,null,"2016-08-05",null,null,null,null,null,null,210,null,null,null,22.9,"NO SATISFACTORIO",null,null,null,null,null,null,null,null,null,null,null,null,null,null,null,null,null,null,null,null,null,null,null,null,80794603,"GARCÍA","RODRÍGUEZ","JOHN","ALEXANDER","Dirección de Signos Distintivos","- Grupo de Trabajo de Oposiciones y Cancelaciones","Dirección de Signos Distintivos - Grupo de Trabajo de Oposiciones y Cancelaciones","Profesional Universitario (Prov)","PROFESIONAL",2044,"05"]
[null,null,null,null,null,null,null,null,null,null,null,null,null,null,null,"2016-08-06",null,null,null,null,null,null,211,null,null,null,23,"NO SATISFACTORIO",null,null,null,null,null,null,null,null,null,null,null,null,null,null,null,null,null,null,null,null,null,null,null,null,52365354,"GARCÍA","SERNA","LUZ","ADRIANA","Dirección Administrativa","- Grupo de Trabajo de Gestión Documental y Recursos Físicos","Dirección Administrativa - Grupo de Trabajo de Gestión Documental y Recursos Físicos","Profesional Especializado","PROFESIONAL",2028,13]
["Orientación a resultados","Realizar las funciones y cumplir los compromisos organizacionales con eficacia y calidad. ","▪ Cumple con oportunidad en función de estándares, objetivos y metas establecidas por la entidad, las funciones que le son asignadas.\n▪ Asume la responsabilidad por sus resultados.\n▪ Compromete recursos y tiempos para mejorar la productividad tomando las medidas necesarias para minimizar los riesgos.\n▪ Realiza todas las acciones necesarias para alcanzar los objetivos propuestos enfrentando los obstáculos que se presentan.",null,null,null,null,null,null,null,null,null,null,null,null,"2016-08-07",null,null,null,null,null,null,212,null,null,null,23.1,"NO SATISFACTORIO",null,null,null,null,null,null,null,null,null,null,null,null,null,null,null,null,null,null,null,null,null,null,null,null,1033681338,"GARCÍA","SOSA","EHUDID","ANDREA","Secretaría General","- Grupo de Trabajo de Talento Humano","Secretaría General - Grupo de Trabajo de Talento Humano","Técnico Administrativo (Prov)","TECNICO",3124,"07"]
["Orientación al usuario y al ciudadano","Dirigir las decisiones y acciones a la satisfacción de las necesidades e intereses de los usuarios internos y externos, de conformidad con las responsabilidades públicas asignadas a la entidad.","▪ Atiende y valora las necesidades y peticiones de los usuarios y de ciudadanos en general.\n▪Considera las necesidades de los usuarios al diseñar proyectos o servicios.\n▪Da respuesta oportuna a las necesidades de los usuarios de conformidad con el servicio que ofrece la entidad.\n▪Establece diferentes canales de comunicación con el usuario para conocer sus necesidades y propuestas y responde a las mismas.\n▪Reconoce la interdependencia entre su trabajo y el de otros.",null,null,null,null,null,null,null,null,null,null,null,null,"2016-08-08",null,null,null,null,null,null,213,null,null,null,23.2,"NO SATISFACTORIO",null,null,null,null,null,null,null,null,null,null,null,null,null,null,null,null,null,null,null,null,null,null,null,null,52258670,"GARCÍA","VARGAS","CLAUDIA","BIBIANA","Dirección de Investigación de Protección de Datos Personales","- Grupo de Trabajo de Habeas Data","Dirección de Investigación de Protección de Datos Personales - Grupo de Trabajo de Habeas Data","Profesional Universitario (Prov)","PROFESIONAL",2044,"05"]
["Transparencia","Hacer uso responsable y claro de los recursos públicos, eliminando cualquier discrecionalidad indebida en su utilización y garantizar el acceso a la información gubernamental.","▪ Proporciona información veraz, objetiva y basada en hechos.\n▪ Facilita el acceso a la información relacionada con sus responsabilidades y con el servicio a cargo de la entidad en que labora.\n▪ Demuestra imparcialidad en sus decisiones.\n▪ Ejecuta sus funciones con base en las normas y criterios aplicables.\n▪ Utiliza los recursos de la entidad para el desarrollo de las labores y la prestación del servicio.",null,null,null,null,null,null,null,null,null,null,null,null,null,null,null,null,null,null,null,null,null,null,null,null,null,null,null,null,null,null,null,null,null,null,null,null,null,null,null,null,null,null,null,null,null,null,null,null,null,52016534,"GARRIDO","TRUJILLO","ALEXANDRA"," -","Oficina de Control Interno","","Oficina de Control Interno ","Profesional Universitario (Prov)","PROFESIONAL",2044,"07"]
["Compromiso con la Organización","Alinear el propio comportamiento a las necesidades, prioridades y metas organizacionales.","▪Promueve las metas de la organización y respeta sus normas.\n▪Antepone las necesidades de la organización a sus propias necesidades.\n▪Apoya a la organización en situaciones difíciles.\n▪Demuestra sentido de pertenencia en todas sus actuaciones.",null,null,null,null,null,null,null,null,null,null,null,null,"2016-08-09",null,null,null,null,null,null,214,null,null,null,23.3,"NO SATISFACTORIO",null,"NIVEL","COMPETENCIA","DEFINICIÒN DE LA COMPETENCIA","CONDUCTAS ASOCIADAS",null,null,null,null,null,null,null,null,null,null,null,null,null,null,null,null,null,null,null,19389837,"GARZÓN","ACOSTA","OMAR","ALBERTO","Oficina de Tecnología e Informática","- Grupo de Trabajo de Sistemas de Información","Oficina de Tecnología e Informática - Grupo de Trabajo de Sistemas de Información","Profesional Especializado (E)","PROFESIONAL",2028,13]
["Experticia profesional (Nivel Asesor)","Aplicar el conocimiento profesional","▪Orienta el desarrollo de proyectos especiales para el logro de resultados de la alta dirección.\n▪Aconseja y orienta la toma de decisiones en los temas que le han sido asignados.\n▪Asesora en materias propias de su campo de conocimiento, emitiendo conceptos, juicios o propuestas ajustados a lineamientos teóricos y técnicos.\n▪Se comunica de modo lógico, claro, efectivo y seguro.",null,null,null,null,null,null,null,null,null,null,null,null,"2016-08-10",null,null,null,null,null,null,215,null,null,null,23.4,"NO SATISFACTORIO",null,"ASESOR","Experticia","Aplicar el conocimiento profesional","▪Orienta el desarrollo de proyectos especiales para el logro de resultados de la alta dirección.\n▪Aconseja y orienta la toma de decisiones en los temas que le han sido asignados.\n▪Asesora en materias propias de su campo de conocimiento, emitiendo conceptos, juicios o propuestas ajustados a lineamientos teóricos y técnicos.\n▪Se comunica de modo lógico, claro, efectivo y seguro.",null,null,null,null,null,null,null,null,null,null,null,null,null,null,null,null,null,null,null,1020741121,"GASTELBONDO","CHIRIVI","MARÍA","CATALINA","Despacho del Superintendente Delegado para la Protección de la Competencia","- Grupo de Trabajo Interdisciplinario de Colusiones","Despacho del Superintendente Delegado para la Protección de la Competencia - Grupo de Trabajo Interdisciplinario de Colusiones","Profesional Universitario (Prov)","PROFESIONAL",2044,"09"]
["Conocimiento del entorno","Conocer e interpretar la organización, su funcionamiento y sus relaciones políticas y administrativas.","▪Comprende el entorno organizacional que enmarca las situaciones objeto de asesoría y lo toma como referente obligado para emitir juicios, conceptos o propuestas a desarrollar.\n▪Se informa permanentemente sobre políticas gubernamentales, problemas y demandas del entorno.",null,null,null,null,null,null,null,null,null,null,null,null,"2016-08-11",null,null,null,null,null,null,216,null,null,null,23.5,"NO SATISFACTORIO",null,"ASESOR","Conocimiento del entorno","Conocer e interpretar la organización, su funcionamiento y sus relaciones políticas y administrativas.","▪Comprende el entorno organizacional que enmarca las situaciones objeto de asesoría y lo toma como referente obligado para emitir juicios, conceptos o propuestas a desarrollar.\n▪Se informa permanentemente sobre políticas gubernamentales, problemas y demandas del entorno.",null,null,null,null,null,null,null,null,null,null,null,null,null,null,null,null,null,null,null,19358668,"GAVIRIA","PEÑA","RICARDO","ALFREDO","Dirección de Investigaciones de Protección al Consumidor","","Dirección de Investigaciones de Protección al Consumidor ","Profesional Universitario (Prov)","PROFESIONAL",2044,10]
["Construcción de relaciones","Establecer y mantener relaciones cordiales y recíprocas con redes o grupos de personas internas y externas a la organización que faciliten la consecución de los objetivos institucionales.","▪Utiliza sus contactos para conseguir objetivos.\n▪Comparte información para establecer lazos.\n▪Interactúa con otros de un modo efectivo y adecuado.",null,null,null,null,null,null,null,null,null,null,null,null,"2016-08-12",null,null,null,null,null,null,217,null,null,null,23.6,"NO SATISFACTORIO",null,"ASESOR","Construcción de relaciones","Establecer y mantener relaciones cordiales y recíprocas con redes o grupos de personas internas y externas a la organización que faciliten la consecución de los objetivos institucionales.","▪Utiliza sus contactos para conseguir objetivos.\n▪Comparte información para establecer lazos.\n▪Interactúa con otros de un modo efectivo y adecuado.",null,null,null,null,null,null,null,null,null,null,null,null,null,null,null,null,null,null,null,52264707,"GIL","ARDILA","GUIOMAR","PATRICIA","Secretaría General","- Grupo de Trabajo de Notificaciones y Certificaciones","Secretaría General - Grupo de Trabajo de Notificaciones y Certificaciones","Profesional Universitario (Prov)","PROFESIONAL",2044,"05"]
["Iniciativa","Anticiparse a los problemas iniciando acciones para superar los obstáculos y alcanzar metas concretas","▪Prevé situaciones y alternativas de solución que orientan la toma de decisiones de la alta dirección.\n▪Enfrenta los problemas y propone acciones concretas para solucionarlos.\n▪Reconoce y hace viables las oportunidades.",null,null,null,null,null,null,null,null,null,null,null,null,"2016-08-13",null,null,null,null,null,null,218,null,null,null,23.7,"NO SATISFACTORIO",null,"ASESOR","Iniciativa","Anticiparse a los problemas iniciando acciones para superar los obstáculos y alcanzar metas concretas","▪Prevé situaciones y alternativas de solución que orientan la toma de decisiones de la alta dirección.\n▪Enfrenta los problemas y propone acciones concretas para solucionarlos.\n▪Reconoce y hace viables las oportunidades.",null,null,null,null,null,null,null,null,null,null,null,null,null,null,null,null,null,null,null,53066085,"GIL","CUERVO","DIANA","CRISTINA","Despacho del Superintendente Delegado para la Protección de Datos Personales",null,"Despacho del Superintendente Delegado para la Protección de Datos Personales ","Asesor","ASESOR",1020,"05"]
["Aprendizaje Continuo","Adquirir y desarrollar permanentemente conocimientos, destrezas y habilidades, con el fin de mantener altos estándares de eficacia organizacional.","▪Aprende de la experiencia de otros y de la propia.\n▪Se adapta y aplica nuevas tecnologías que se implanten en la organización.\n▪Aplica los conocimientos adquiridos a los desafíos que se presentan en el desarrollo del trabajo.\n▪Investiga, indaga y profundiza en los temas de su entorno área de desempeño.\n▪Reconoce las propias limitaciones y las necesidades de mejorar su preparación.\n▪Asimila nueva información y la aplica correctamente.",null,null,null,null,null,null,null,null,null,null,null,null,"2016-08-14",null,null,null,null,null,null,219,null,null,null,23.8,"NO SATISFACTORIO",null,"ASESOR","Orientación a resultados ","Realizar las funciones y cumplir los compromisos organizacionales con eficacia y calidad. ","▪ Cumple con oportunidad en función de estándares, objetivos y metas establecidas por la entidad, las funciones que le son asignadas.\n▪ Asume la responsabilidad por sus resultados.\n▪ Compromete recursos y tiempos para mejorar la productividad tomando las medidas necesarias para minimizar los riesgos.\n▪ Realiza todas las acciones necesarias para alcanzar los objetivos propuestos enfrentando los obstáculos que se presentan.",null,null,null,null,null,null,null,null,null,null,null,null,null,null,null,null,null,null,null,80503882,"GIL","HELFFHRITTZ","ANDRÉS"," -","Dirección de Nuevas Creaciones","- Grupo de Trabajo de Ciencias Químicas","Dirección de Nuevas Creaciones - Grupo de Trabajo de Ciencias Químicas","Profesional Universitario (Prov)","PROFESIONAL",2044,"09"]
["Experticia profesional (Nivel profesional)","Aplicar el conocimiento profesional en la resolución de problemas y transferirlo a su entorno laboral.","▪Analiza de un modo sistemático y racional los aspectos del trabajo, basándose en la información relevante.\n▪Aplica reglas básicas y conceptos complejos aprendidos\n▪Identifica y reconoce con facilidad las causas de los problemas y sus soluciones.\n▪Clarifica datos o situaciones complejas.\n▪Planea, organiza y ejecuta múltiples tareas tendientes a alcanzar resultados institucionales.",null,null,null,null,null,null,null,null,null,null,null,null,"2016-08-15",null,null,null,null,null,null,220,null,null,null,23.9,"NO SATISFACTORIO",null,"ASESOR","Orientación al usuario y al ciudadano","Dirigir las decisiones y acciones a la satisfacción de las necesidades e intereses de los usuarios internos y externos, de conformidad con las responsabilidades públicas asignadas a la entidad.","▪ Atiende y valora las necesidades y peticiones de los usuarios y de ciudadanos en general.\n▪Considera las necesidades de los usuarios al diseñar proyectos o servicios.\n▪Da respuesta oportuna a las necesidades de los usuarios de conformidad con el servicio que ofrece la entidad.\n▪Establece diferentes canales de comunicación con el usuario para conocer sus necesidades y propuestas y responde a las mismas.\n▪Reconoce la interdependencia entre su trabajo y el de otros.\n",null,null,null,null,null,null,null,null,null,null,null,null,null,null,null,null,null,null,null,79505592,"GIRALDO","LÓPEZ","ALEJANDRO"," -","Despacho del Superintendente Delegado para el Control y Verificación de Reglamentos Técnicos y Metrología Legal","","Despacho del Superintendente Delegado para el Control y Verificación de Reglamentos Técnicos y Metrología Legal ","Superintendente Delegado","DIRECTIVO","0110",19]
["Trabajo en equipo y Colaboración","Trabajar con otros de forma conjunta y de manera participativa, integrando esfuerzos para la consecución de metas institucionales comunes.","▪Coopera en distintas situaciones y comparte información.\n▪Aporta sugerencias, ideas y opiniones.\n▪Expresa expectativas positivas del equipo o de los miembros del mismo.\n▪Planifica las propias acciones teniendo en cuenta la repercusión de las mismas para la consecución de los objetivos grupales.\n▪Establece diálogo directo con los miembros del equipo que permita compartir información e ideas en condiciones de respeto y cordialidad.\n▪Respeta criterios dispares y distintas opiniones del equipo.",null,null,null,null,null,null,null,null,null,null,null,null,"2016-08-16",null,null,null,null,null,null,221,null,null,null,24,"NO SATISFACTORIO",null,"ASESOR","Compromiso con la Organización","Alinear el propio comportamiento a las necesidades, prioridades y metas organizacionales.","▪Promueve las metas de la organización y respeta sus normas.\n▪Antepone las necesidades de la organización a sus propias necesidades.\n▪Apoya a la organización en situaciones difíciles.\n▪Demuestra sentido de pertenencia en todas sus actuaciones.",null,null,null,null,null,null,null,null,null,null,null,null,null,null,null,null,null,null,null,39777348,"GNECCO","ARREGOCES","NATALIA","MARÍA","Oficina de Servicios al Consumidor y de Apoyo Empresarial","- Grupo de Trabajo de Comunicación","Oficina de Servicios al Consumidor y de Apoyo Empresarial - Grupo de Trabajo de Comunicación","Profesional Especializado (Prov)","PROFESIONAL",2028,17]
["Creatividad e Innovación (Nivel profesional)","Generar y desarrollar nuevas ideas, conceptos, métodos y soluciones.","▪Ofrece respuestas alternativas.\n▪Aprovecha las oportunidades y problemas para dar soluciones novedosas.\n▪Desarrolla nuevas formas de hacer y tecnologías.\n▪Busca nuevas alternativas de solución y se arriesga a romper esquemas tradicionales.\n▪Inicia acciones para superar los obstáculos y alcanzar metas específicas.",null,null,null,null,null,null,null,null,null,null,null,null,"2016-08-17",null,null,null,null,null,null,222,null,null,null,24.1,"NO SATISFACTORIO",null,"PROFESIONAL","Aprendizaje Continuo","Adquirir y desarrollar permanentemente conocimientos, destrezas y habilidades, con el fin de mantener altos estándares de eficacia organizacional.","▪Aprende de la experiencia de otros y de la propia.\n▪Se adapta y aplica nuevas tecnologías que se implanten en la organización.\n▪Aplica los conocimientos adquiridos a los desafíos que se presentan en el desarrollo del trabajo.\n▪Investiga, indaga y profundiza en los temas de su entorno área de desempeño.\n▪Reconoce las propias limitaciones y las necesidades de mejorar su preparación.\n▪Asimila nueva información y la aplica correctamente.",null,null,null,null,null,null,null,null,null,null,null,null,null,null,null,null,null,null,null,1102813078,"GÓMEZ","MONTERROZA","MARGARITA","ROSA","Oficina Asesora Jurídica","- Grupo de Trabajo de Cobro Coactivo","Oficina Asesora Jurídica - Grupo de Trabajo de Cobro Coactivo","Profesional Universitario (Prov)","PROFESIONAL",2044,"03"]
["Liderazgo de Grupos de Trabajo","Asumir el rol de orientar y guía de un grupo o equipo de trabajo, utilizando la autoridad con arreglo a las normas y promoviendo la Efectividad en la consecución de objetivos y metas institucionales.","▪Establece los objetivos del grupo de forma clara y equilibrada.\n▪Asegura que los integrantes del grupo compartan planes, programas y proyectos institucionales.\n▪Orienta y coordina el trabajo del grupo para la identificación de planes y actividades a seguir.\n▪Facilita la colaboración con otras áreas y dependencias.\n▪Escucha y tiene en cuenta las opiniones de los integrantes del grupo.\n▪Gestiona los recursos necesarios para poder cumplir con las metas propuestas.\n▪Garantiza los recursos necesarios para poder cumplir con las metas propuestas.\n▪Garantiza que el grupo tenga la información necesaria.\n▪Explica las razones de las decisiones.",null,null,null,null,null,null,null,null,null,null,null,null,"2016-08-18",null,null,null,null,null,null,223,null,null,null,24.2,"NO SATISFACTORIO",null,"PROFESIONAL","Experticia profesional","Aplicar el conocimiento profesional en la resolución de problemas y transferirlo a su entorno laboral.","▪Analiza de un modo sistemático y racional los aspectos del trabajo, basándose en la información relevante.\n▪Aplica reglas básicas y conceptos complejos aprendidos\n▪Identifica y reconoce con facilidad las causas de los problemas y sus soluciones.\n▪Clarifica datos o situaciones complejas.\n▪Planea, organiza y ejecuta múltiples tareas tendientes a alcanzar resultados institucionales.\n",null,null,null,null,null,null,null,null,null,null,null,null,null,null,null,null,null,null,null,1030530215,"GÓMEZ","MORENO","XIOMARA","YINNA","Dirección de Signos Distintivos","- Grupo de Trabajo de Forma","Dirección de Signos Distintivos - Grupo de Trabajo de Forma","Profesional Universitario (Prov)","PROFESIONAL",2044,"01"]
["Toma de decisiones","Elegir entre una o varias alternativas para solucionar un problema y tomar las acciones concretas y consecuentes con la elección realizada.","▪Elige alternativas de solución efectiva y suficiente para atender los asuntos encomendados.\n▪Decide y establece prioridades para el trabajo del grupo.\n▪Asume posiciones concretas para el manejo de temas o situaciones que demandan su atención.\n▪Efectúa cambios en las actividades o en la manera de desarrollar sus responsabilidades cuando detecta dificultades para su realización o mejores prácticas que pueden optimizar el desempeño.\n▪Asume las consecuencias de las decisiones adoptadas.\n▪Fomenta la participación en la toma de decisiones.",null,null,null,null,null,null,null,null,null,null,null,null,"2016-08-19",null,null,null,null,null,null,224,null,null,null,24.3,"NO SATISFACTORIO",null,"PROFESIONAL","Trabajo en equipo y Colaboración","Trabajar con otros de forma conjunta y de manera participativa, integrando esfuerzos para la consecución de metas institucionales comunes.","▪Coopera en distintas situaciones y comparte información.\n▪Aporta sugerencias, ideas y opiniones.\n▪Expresa expectativas positivas del equipo o de los miembros del mismo.\n▪Planifica las propias acciones teniendo en cuenta la repercusión de las mismas para la consecución de los objetivos grupales.\n▪Establece diálogo directo con los miembros del equipo que permita compartir información e ideas en condiciones de respeto y cordialidad.\n▪Respeta criterios dispares y distintas opiniones del equipo.",null,null,null,null,null,null,null,null,null,null,null,null,null,null,null,null,null,null,null,52981785,"GÓMEZ","MOYA","OLGA","VIVIANA","Secretaría General","- Grupo de Trabajo de Talento Humano","Secretaría General - Grupo de Trabajo de Talento Humano","Profesional Universitario (Prov)","PROFESIONAL",2044,"07"]
["Experticia Técnica","Entender y aplicar los conocimientos técnicos del área de desempeño y mantenerlos actualizados","▪Capta y asimila con facilidad conceptos e información.\n▪Aplica el conocimiento técnico a las actividades cotidianas.\n▪Analiza la información de acuerdo con las necesidades de la organización.\n▪Comprende los aspectos técnicos y los aplica al desarrollo de procesos y procedimientos en los que está involucrado.\n▪Resuelve problemas utilizando sus conocimientos técnicos de su especialidad y garantizando indicadores y estándares establecidos.",null,null,null,null,null,null,null,null,null,null,null,null,"2016-08-20",null,null,null,null,null,null,225,null,null,null,24.4,"NO SATISFACTORIO",null,"PROFESIONAL","Creatividad e Innovación","Generar y desarrollar nuevas ideas, conceptos, métodos y soluciones.","▪Ofrece respuestas alternativas.\n▪Aprovecha las oportunidades y problemas para dar soluciones novedosas.\n▪Desarrolla nuevas formas de hacer y tecnologías.\n▪Busca nuevas alternativas de solución y se arriesga a romper esquemas tradicionales.\n▪Inicia acciones para superar los obstáculos y alcanzar metas específicas.",null,null,null,null,null,null,null,null,null,null,null,null,null,null,null,null,null,null,null,52981786,"GÓMEZ","MOYA","SANDRA","MARGARITA","Dirección de Cámaras de Comercio","- Grupo de Trabajo de Vigilancia de las Cámaras de Comercio y a los Comerciantes","Dirección de Cámaras de Comercio - Grupo de Trabajo de Vigilancia de las Cámaras de Comercio y a los Comerciantes","Profesional Universitario (Prov)","PROFESIONAL",2044,"03"]
["Trabajo en equipo","Trabajar con otros para conseguir metas comunes","▪Identifica claramente los objetivos del grupo y orienta su trabajo a la consecución de los mismos.\n▪Colabora con otros para la realización de actividades y metas grupales.",null,null,null,null,null,null,null,null,null,null,null,null,"2016-08-21",null,null,null,null,null,null,226,null,null,null,24.5,"NO SATISFACTORIO",null,"PROFESIONAL","Orientación a resultados ","Realizar las funciones y cumplir los compromisos organizacionales con eficacia y calidad. ","▪ Cumple con oportunidad en función de estándares, objetivos y metas establecidas por la entidad, las funciones que le son asignadas.\n▪ Asume la responsabilidad por sus resultados.\n▪ Compromete recursos y tiempos para mejorar la productividad tomando las medidas necesarias para minimizar los riesgos.\n▪ Realiza todas las acciones necesarias para alcanzar los objetivos propuestos enfrentando los obstáculos que se presentan.",null,null,null,null,null,null,null,null,null,null,null,null,null,null,null,null,null,null,null,53050262,"GÓMEZ","PIZA","HELIANA","EUGENIA","Dirección Administrativa","- Grupo de Trabajo de Gestión Documental y Recursos Físicos","Dirección Administrativa - Grupo de Trabajo de Gestión Documental y Recursos Físicos","Profesional Universitario (Prov)","PROFESIONAL",2044,"03"]
["Creatividad e innovación (Nivel técnico)","Presentar ideas y métodos novedosos y concretarlos en acciones","▪Propone y encuentra formas nuevas y eficaces de hacer las cosas.\n▪Es recursivo.\n▪Es práctico.\n▪Busca nuevas alternativas de solución.\n▪Revisa permanentemente los procesos y procedimientos para optimizar los resultados.",null,null,null,null,null,null,null,null,null,null,null,null,"2016-08-22",null,null,null,null,null,null,227,null,null,null,24.599999999999898,"NO SATISFACTORIO",null,"PROFESIONAL","Orientación al usuario y al ciudadano","Dirigir las decisiones y acciones a la satisfacción de las necesidades e intereses de los usuarios internos y externos, de conformidad con las responsabilidades públicas asignadas a la entidad.","▪ Atiende y valora las necesidades y peticiones de los usuarios y de ciudadanos en general.\n▪Considera las necesidades de los usuarios al diseñar proyectos o servicios.\n▪Da respuesta oportuna a las necesidades de los usuarios de conformidad con el servicio que ofrece la entidad.\n▪Establece diferentes canales de comunicación con el usuario para conocer sus necesidades y propuestas y responde a las mismas.\n▪Reconoce la interdependencia entre su trabajo y el de otros.\n",null,null,null,null,null,null,null,null,null,null,null,null,null,null,null,null,null,null,null,39775740,"GONGORA","PINILLA","MARCELA"," -","Oficina de Servicios al Consumidor y de Apoyo Empresarial","- Grupo de Trabajo de Formación","Oficina de Servicios al Consumidor y de Apoyo Empresarial - Grupo de Trabajo de Formación","Profesional Universitario (E)","PROFESIONAL",2044,10]
["Manejo de la información","Manejar con respeto las informaciones personales e institucionales de que dispone.","▪Evade temas que indagan sobre información confidencial.\n▪Recoge sólo información imprescindible para el desarrollo de la tarea.\n▪Organiza y guarda de forma adecuada la información a su cuidado, teniendo en cuenta las normas legales y de la organización.\n▪No hace pública información laboral o de las personas que pueda afectar la organización o las personas.",null,null,null,null,null,null,null,null,null,null,null,null,"2016-08-23",null,null,null,null,null,null,228,null,null,"DIEZ",24.6999999999999,"NO SATISFACTORIO",null,"PROFESIONAL","Compromiso con la Organización","Alinear el propio comportamiento a las necesidades, prioridades y metas organizacionales.","▪Promueve las metas de la organización y respeta sus normas.\n▪Antepone las necesidades de la organización a sus propias necesidades.\n▪Apoya a la organización en situaciones difíciles.\n▪Demuestra sentido de pertenencia en todas sus actuaciones.",null,null,null,null,null,null,null,null,null,null,null,null,null,null,null,null,null,null,null,52155238,"GONZÁLEZ","ACEVEDO","DIANA","CONSUELO","Dirección de Investigaciones de Protección al Consumidor","","Dirección de Investigaciones de Protección al Consumidor ","Profesional Especializado (E)","PROFESIONAL",2028,13]
["Adaptación al cambio","Enfrentarse con flexibilidad y versatilidad a situaciones nuevas para aceptar los cambios positiva y constructivamente.","▪Acepta y se adapta fácilmente los cambios.\n▪Responde al cambio con flexibilidad.\n▪Promueve el cambio.",null,null,null,null,null,null,null,null,null,null,null,null,"2016-08-24",null,null,null,null,null,null,229,null,null,null,24.799999999999901,"NO SATISFACTORIO",null,"PROFESIONAL CON PERSONAL A CARGO","Aprendizaje Continuo","Adquirir y desarrollar permanentemente conocimientos, destrezas y habilidades, con el fin de mantener altos estándares de eficacia organizacional.","▪Aprende de la experiencia de otros y de la propia.\n▪Se adapta y aplica nuevas tecnologías que se implanten en la organización.\n▪Aplica los conocimientos adquiridos a los desafíos que se presentan en el desarrollo del trabajo.\n▪Investiga, indaga y profundiza en los temas de su entorno área de desempeño.\n▪Reconoce las propias limitaciones y las necesidades de mejorar su preparación.\n▪Asimila nueva información y la aplica correctamente.",null,null,null,null,null,null,null,null,null,null,null,null,null,null,null,null,null,null,null,79305026,"GONZÁLEZ","AGUIRRE","JOSÉ","VICTOR","Oficina Asesora Jurídica","","Oficina Asesora Jurídica ","Profesional Universitario (Prov)","PROFESIONAL",2044,11]
["Disciplina","Adaptarse a las políticas institucionales y buscar información de los cambios en la autoridad competente.","▪Acepta instrucciones aunque se difiera de ellas.\n▪Realiza los cometidos y tareas del puesto de trabajo.\n▪Acepta la supervisión constante.\n▪Realiza funciones orientadas a apoyar la acción de otros miembros de la organización.",null,null,null,null,null,null,null,null,null,null,null,null,"2016-08-25",null,null,null,null,null,null,230,null,null,null,24.899999999999899,"NO SATISFACTORIO",null,"PROFESIONAL CON PERSONAL A CARGO","Experticia profesional","Aplicar el conocimiento profesional en la resolución de problemas y transferirlo a su entorno laboral.","▪Analiza de un modo sistemático y racional los aspectos del trabajo, basándose en la información relevante.\n▪Aplica reglas básicas y conceptos complejos aprendidos\n▪Identifica y reconoce con facilidad las causas de los problemas y sus soluciones.\n▪Clarifica datos o situaciones complejas.\n▪Planea, organiza y ejecuta múltiples tareas tendientes a alcanzar resultados institucionales.\n",null,null,null,null,null,null,null,null,null,null,null,null,null,null,null,null,null,null,null,41794127,"GONZÁLEZ","FONSECA","OLGA","ROSA","Dirección de Nuevas Creaciones","- Grupo de Trabajo de Ciencias Farmacéuticas y Biológicas","Dirección de Nuevas Creaciones - Grupo de Trabajo de Ciencias Farmacéuticas y Biológicas","Profesional Especializado (E)","PROFESIONAL",2028,13]
["Relaciones Interpersonales","Establecer y mantener relaciones de trabajo amistosas y positivas, basadas en la comunicación abierta y fluida y en el respeto por los demás.","▪Escucha con interés a las personas y capta las preocupaciones, intereses y necesidades de los demás.\n▪Transmite eficazmente las ideas, sentimientos e información impidiendo con ello malos entendidos o situaciones confusas que puedan generar conflictos.",null,null,null,null,null,null,null,null,null,null,null,null,"2016-08-26",null,null,null,null,null,null,231,null,null,null,24.999999999999901,"NO SATISFACTORIO",null,"PROFESIONAL CON PERSONAL A CARGO","Trabajo en equipo y Colaboración","Trabajar con otros de forma conjunta y de manera participativa, integrando esfuerzos para la consecución de metas institucionales comunes.","▪Coopera en distintas situaciones y comparte información.\n▪Aporta sugerencias, ideas y opiniones.\n▪Expresa expectativas positivas del equipo o de los miembros del mismo.\n▪Planifica las propias acciones teniendo en cuenta la repercusión de las mismas para la consecución de los objetivos grupales.\n▪Establece diálogo directo con los miembros del equipo que permita compartir información e ideas en condiciones de respeto y cordialidad.\n▪Respeta criterios dispares y distintas opiniones del equipo.",null,null,null,null,null,null,null,null,null,null,null,null,null,null,null,null,null,null,null,10967417,"GONZÁLEZ","PALMA","JUAN","DAVID","Despacho del Superintendente Delegado para Asuntos Jurisdiccionales","- Grupo de Trabajo de Defensa del Consumidor","Despacho del Superintendente Delegado para Asuntos Jurisdiccionales - Grupo de Trabajo de Defensa del Consumidor","Profesional Universitario (Prov)","PROFESIONAL",2044,"01"]
["Colaboración","Cooperar con los demás con el fin de alcanzar los objetivos institucionales","▪Ayuda al logro de los objetivos articulando sus actuaciones con los demás.\n▪Cumple los compromisos que adquiere.\n▪Facilita la labor de sus superiores y compañeros de trabajo.",null,null,null,null,null,null,null,null,null,null,null,null,"2016-08-27",null,null,null,null,null,null,232,null,null,null,25.099999999999898,"NO SATISFACTORIO",null,"PROFESIONAL CON PERSONAL A CARGO","Creatividad e Innovación","Generar y desarrollar nuevas ideas, conceptos, métodos y soluciones.","▪Ofrece respuestas alternativas.\n▪Aprovecha las oportunidades y problemas para dar soluciones novedosas.\n▪Desarrolla nuevas formas de hacer y tecnologías.\n▪Busca nuevas alternativas de solución y se arriesga a romper esquemas tradicionales.\n▪Inicia acciones para superar los obstáculos y alcanzar metas específicas.",null,null,null,null,null,null,null,null,null,null,null,null,null,null,null,null,null,null,null,51602771,"GONZÁLEZ","PIÑEROS","MARTHA","LUCÍA","Dirección de Investigaciones de Protección al Consumidor","","Dirección de Investigaciones de Protección al Consumidor ","Profesional Universitario (Prov)","PROFESIONAL",2044,"07"]
[null,null,null,null,null,null,null,null,null,null,null,null,null,null,null,"2016-08-28",null,null,null,null,null,null,233,null,null,null,25.1999999999999,"NO SATISFACTORIO",null,"PROFESIONAL CON PERSONAL A CARGO","Orientación a resultados ","Realizar las funciones y cumplir los compromisos organizacionales con eficacia y calidad. ","▪ Cumple con oportunidad en función de estándares, objetivos y metas establecidas por la entidad, las funciones que le son asignadas.\n▪ Asume la responsabilidad por sus resultados.\n▪ Compromete recursos y tiempos para mejorar la productividad tomando las medidas necesarias para minimizar los riesgos.\n▪ Realiza todas las acciones necesarias para alcanzar los objetivos propuestos enfrentando los obstáculos que se presentan.",null,null,null,null,null,null,null,null,null,null,null,null,null,null,null,null,null,null,null,79890905,"GONZÁLEZ","RABA","JOHN","ANDERSON","Despacho del Superintendente Delegado para la Protección de la Competencia","","Despacho del Superintendente Delegado para la Protección de la Competencia ","Conductor Mecánico (Prov)","ASISTENCIAL",4103,11]
[null,null,null,null,null,null,null,null,null,null,null,null,null,null,null,"2016-08-29",null,null,null,null,null,null,234,null,null,null,25.299999999999901,"NO SATISFACTORIO",null,"PROFESIONAL CON PERSONAL A CARGO","Orientación al usuario y al ciudadano","Dirigir las decisiones y acciones a la satisfacción de las necesidades e intereses de los usuarios internos y externos, de conformidad con las responsabilidades públicas asignadas a la entidad.","▪ Atiende y valora las necesidades y peticiones de los usuarios y de ciudadanos en general.\n▪Considera las necesidades de los usuarios al diseñar proyectos o servicios.\n▪Da respuesta oportuna a las necesidades de los usuarios de conformidad con el servicio que ofrece la entidad.\n▪Establece diferentes canales de comunicación con el usuario para conocer sus necesidades y propuestas y responde a las mismas.\n▪Reconoce la interdependencia entre su trabajo y el de otros.\n",null,null,null,null,null,null,null,null,null,null,null,null,null,null,null,null,null,null,null,79169799,"GONZÁLEZ","RINCON","FABIAN","ORLANDO","Oficina de Control Interno","","Oficina de Control Interno ","Profesional Universitario (Prov)","PROFESIONAL",2044,"01"]
["NIVELES DE PROFUNDIZACION DE LA COMPETENCIAS","RESULTADOS CUANTITATIVOS",null,null,null,null,"RESULTADOS CUANTITATIVOS",null,null,null,null,null,null,null,null,"2016-08-30",null,null,null,null,null,null,235,null,null,null,25.399999999999899,"NO SATISFACTORIO",null,"PROFESIONAL CON PERSONAL A CARGO","Compromiso con la Organización","Alinear el propio comportamiento a las necesidades, prioridades y metas organizacionales.","▪Promueve las metas de la organización y respeta sus normas.\n▪Antepone las necesidades de la organización a sus propias necesidades.\n▪Apoya a la organización en situaciones difíciles.\n▪Demuestra sentido de pertenencia en todas sus actuaciones.",null,null,null,null,null,null,null,null,null,null,null,null,null,null,null,null,null,null,null,80735076,"GONZÁLEZ","TAMAYO","JOSÉ","ALEXANDER","Dirección de Investigación de Protección de Datos Personales","- Grupo de Trabajo de Habeas Data","Dirección de Investigación de Protección de Datos Personales - Grupo de Trabajo de Habeas Data","Técnico Administrativo (Prov)","TECNICO",3124,"07"]
["NO EVALUADO",0,null,null,null,null,null,null,null,null,null,null,null,null,null,"2016-08-31",null,null,null,null,null,null,236,null,null,null,25.499999999999901,"NO SATISFACTORIO",null,"PROFESIONAL CON PERSONAL A CARGO","Liderazgo de Grupos de Trabajo","Asumir el rol de orientar y guía de un grupo o equipo de trabajo, utilizando la autoridad con arreglo a las normas y promoviendo la Efectividad en la consecución de objetivos y metas institucionales.","▪Establece los objetivos del grupo de forma clara y equilibrada.\n▪Asegura que los integrantes del grupo compartan planes, programas y proyectos institucionales.\n▪Orienta y coordina el trabajo del grupo para la identificación de planes y actividades a seguir.\n▪Facilita la colaboración con otras áreas y dependencias.\n▪Escucha y tiene en cuenta las opiniones de los integrantes del grupo.\n▪Gestiona los recursos necesarios para poder cumplir con las metas propuestas.\n▪Garantiza los recursos necesarios para poder cumplir con las metas propuestas.\n▪Garantiza que el grupo tenga la información necesaria.\n▪Explica las razones de las decisiones.",null,null,null,null,null,null,null,null,null,null,null,null,null,null,null,null,null,null,null,1020754887,"GRANADOS","VENEGAS","JUAN","FRANCISCO","Oficina Asesora Jurídica","- Grupo de Trabajo de Gestión Judicial","Oficina Asesora Jurídica - Grupo de Trabajo de Gestión Judicial","Profesional Universitario (Prov)","PROFESIONAL",2044,"05"]
["BAJO",4,null,null,null,null,4,null,null,null,null,null,null,null,null,"2016-09-01",null,null,null,null,null,null,237,null,null,null,25.599999999999898,"NO SATISFACTORIO",null,"PROFESIONAL CON PERSONAL A CARGO","Toma de decisiones","Elegir entre una o varias alternativas para solucionar un problema y tomar las acciones concretas y consecuentes con la elección realizada.","▪Elige alternativas de solución efectiva y suficiente para atender los asuntos encomendados.\n▪Decide y establece prioridades para el trabajo del grupo.\n▪Asume posiciones concretas para el manejo de temas o situaciones que demandan su atención.\n▪Efectúa cambios en las actividades o en la manera de desarrollar sus responsabilidades cuando detecta dificultades para su realización o mejores prácticas que pueden optimizar el desempeño.\n▪Asume las consecuencias de las decisiones adoptadas.\n▪Fomenta la participación en la toma de decisiones.",null,null,null,null,null,null,null,null,null,null,null,null,null,null,null,null,null,null,null,79054648,"GUALTEROS","PEÑA","JARBIS","ERNESTO","Dirección Administrativa","- Grupo de Trabajo de Gestión Documental y Recursos Físicos","Dirección Administrativa - Grupo de Trabajo de Gestión Documental y Recursos Físicos","Auxiliar de Servicios Generales (Prov)","ASISTENCIAL",4064,"05"]
["ACEPTABLE",6,5,null,null,null,6,null,null,null,null,null,null,null,null,"2016-09-02",null,null,null,null,null,null,238,null,null,null,25.6999999999999,"NO SATISFACTORIO",null,"PROFESIONAL CON PERSONAL A CARGO","Orientación a resultados ","Realizar las funciones y cumplir los compromisos organizacionales con eficacia y calidad. ","▪ Cumple con oportunidad en función de estándares, objetivos y metas establecidas por la entidad, las funciones que le son asignadas.\n▪ Asume la responsabilidad por sus resultados.\n▪ Compromete recursos y tiempos para mejorar la productividad tomando las medidas necesarias para minimizar los riesgos.\n▪ Realiza todas las acciones necesarias para alcanzar los objetivos propuestos enfrentando los obstáculos que se presentan.",null,null,null,null,null,null,null,null,null,null,null,null,null,null,null,null,null,null,null,74082776,"GUARIN","CASTRO","LEONARDO","GEOVANNI","Secretaría General","- Grupo de Trabajo de Notificaciones y Certificaciones","Secretaría General - Grupo de Trabajo de Notificaciones y Certificaciones","Profesional Universitario (Prov)","PROFESIONAL",2044,10]
["ALTO",8,null,null,null,null,8,null,null,null,null,null,null,null,null,"2016-09-03",null,null,null,null,null,null,239,null,null,null,25.799999999999901,"NO SATISFACTORIO",null,"PROFESIONAL CON PERSONAL A CARGO","Orientación al usuario y al ciudadano","Dirigir las decisiones y acciones a la satisfacción de las necesidades e intereses de los usuarios internos y externos, de conformidad con las responsabilidades públicas asignadas a la entidad.","▪ Atiende y valora las necesidades y peticiones de los usuarios y de ciudadanos en general.\n▪Considera las necesidades de los usuarios al diseñar proyectos o servicios.\n▪Da respuesta oportuna a las necesidades de los usuarios de conformidad con el servicio que ofrece la entidad.\n▪Establece diferentes canales de comunicación con el usuario para conocer sus necesidades y propuestas y responde a las mismas.\n▪Reconoce la interdependencia entre su trabajo y el de otros.\n",null,null,null,null,null,null,null,null,null,null,null,null,null,null,null,null,null,null,null,80227524,"GUARÍN","VILLABÓN","DIEGO","ANDRÉS","Despacho del Superintendente Delegado para Asuntos Jurisdiccionales","- Grupo de Trabajo de Competencia Desleal y Propiedad Industrial","Despacho del Superintendente Delegado para Asuntos Jurisdiccionales - Grupo de Trabajo de Competencia Desleal y Propiedad Industrial","Profesional Especializado (Prov)","PROFESIONAL",2028,13]
["MUY ALTO",10,null,null,null,null,10,null,null,null,null,null,null,null,null,"2016-09-04",null,null,null,null,null,null,240,null,null,null,25.899999999999899,"NO SATISFACTORIO",null,"PROFESIONAL CON PERSONAL A CARGO","Compromiso con la Organización","Alinear el propio comportamiento a las necesidades, prioridades y metas organizacionales.","▪Promueve las metas de la organización y respeta sus normas.\n▪Antepone las necesidades de la organización a sus propias necesidades.\n▪Apoya a la organización en situaciones difíciles.\n▪Demuestra sentido de pertenencia en todas sus actuaciones.",null,null,null,null,null,null,null,null,null,null,null,null,null,null,null,null,null,null,null,52984495,"GUERRA","BOHÓRQUEZ","ALBA","ROCÍO","Dirección Administrativa","- Grupo de Trabajo de Gestión Documental y Recursos Físicos","Dirección Administrativa - Grupo de Trabajo de Gestión Documental y Recursos Físicos","Auxiliar Administrativo (Prov)","ASISTENCIAL",4044,11]
[null,null,null,null,null,null,null,null,null,null,null,null,null,null,null,"2016-09-05",null,null,null,null,null,null,241,null,null,null,25.999999999999901,"NO SATISFACTORIO",null,"TÈCNICO","Experticia Técnica","Entender y aplicar los conocimientos técnicos del área de desempeño y mantenerlos actualizados","▪Capta y asimila con facilidad conceptos e información.\n▪Aplica el conocimiento técnico a las actividades cotidianas.\n▪Analiza la información de acuerdo con las necesidades de la organización.\n▪Comprende los aspectos técnicos y los aplica al desarrollo de procesos y procedimientos en los que está involucrado.\n▪Resuelve problemas utilizando sus conocimientos técnicos de su especialidad y garantizando indicadores y estándares establecidos.",null,null,null,null,null,null,null,null,null,null,null,null,null,null,null,null,null,null,null,1018453600,"GUERRERO","DELGADO","SERGIO"," -","Despacho del Superintendente Delegado para la Protección de la Competencia","- Grupo de Trabajo de Protección y Promoción de la Competencia","Despacho del Superintendente Delegado para la Protección de la Competencia - Grupo de Trabajo de Protección y Promoción de la Competencia","Profesional Universitario (Prov)","PROFESIONAL",2044,"01"]
[null,null,null,null,null,null,null,null,null,null,null,null,null,null,null,"2016-09-06",null,null,null,null,null,null,242,null,null,null,26.099999999999898,"NO SATISFACTORIO",null,"TÈCNICO","Trabajo en equipo","Trabajar con otros para conseguir metas comunes","▪Identifica claramente los objetivos del grupo y orienta su trabajo a la consecución de los mismos.\n▪Colabora con otros para la realización de actividades y metas grupales.",null,null,null,null,null,null,null,null,null,null,null,null,null,null,null,null,null,null,null,59824255,"GUERRERO","MUÑOZ","SANDRA","JANNETH","Despacho del Superintendente Delegado para la Protección de la Competencia","- Grupo de Trabajo de Prácticas Restrictivas de la Competencia","Despacho del Superintendente Delegado para la Protección de la Competencia - Grupo de Trabajo de Prácticas Restrictivas de la Competencia","Profesional Universitario (E)","PROFESIONAL",2044,11]
[1,"1. Cambios en los planes, programas o proyectos que sirvieron de base para la concertación.",null,null,null,null,null,null,null,null,null,null,null,null,null,"2016-09-07",null,null,null,null,null,null,243,null,null,null,26.1999999999999,"NO SATISFACTORIO",null,"TÈCNICO","Creatividad e innovación","Presentar ideas y métodos novedosos y concretarlos en acciones","▪Propone y encuentra formas nuevas y eficaces de hacer las cosas.\n▪Es recursivo.\n▪Es práctico.\n▪Busca nuevas alternativas de solución.\n▪Revisa permanentemente los procesos y procedimientos para optimizar los resultados.",null,null,null,null,null,null,null,null,null,null,null,null,null,null,null,null,null,null,null,79999200,"GUERRERO","SUAREZ","LENIN","ROBERTO","Dirección de Nuevas Creaciones","- Grupo de Trabajo de Ciencias Farmacéuticas y Biológicas","Dirección de Nuevas Creaciones - Grupo de Trabajo de Ciencias Farmacéuticas y Biológicas","Profesional Universitario (Prov)","PROFESIONAL",2044,"01"]
[2,"2. Separación del cargo superior a treinta (30) días calendario que afecte el cumplimiento de los compromisos. ",null,null,null,null,null,null,null,null,null,null,null,null,null,"2016-09-08",null,null,null,null,null,null,244,null,null,null,26.299999999999901,"NO SATISFACTORIO",null,"TÈCNICO","Orientación a resultados ","Realizar las funciones y cumplir los compromisos organizacionales con eficacia y calidad. ","▪ Cumple con oportunidad en función de estándares, objetivos y metas establecidas por la entidad, las funciones que le son asignadas.\n▪ Asume la responsabilidad por sus resultados.\n▪ Compromete recursos y tiempos para mejorar la productividad tomando las medidas necesarias para minimizar los riesgos.\n▪ Realiza todas las acciones necesarias para alcanzar los objetivos propuestos enfrentando los obstáculos que se presentan.",null,null,null,null,null,null,null,null,null,null,null,null,null,null,null,null,null,null,null,52379194,"GUILLÉN","OLAYA","SARAH","PAOLA ANDREA","Dirección Administrativa",null,"Dirección Administrativa ","Profesional Universitario (Prov)","PROFESIONAL",2044,"05"]
[3,"3. Traslado o encargo del empleado.",null,null,null,null,null,null,null,null,null,null,null,null,null,"2016-09-09",null,null,null,null,null,null,245,null,null,null,26.399999999999899,"NO SATISFACTORIO",null,"TÈCNICO","Orientación al usuario y al ciudadano","Dirigir las decisiones y acciones a la satisfacción de las necesidades e intereses de los usuarios internos y externos, de conformidad con las responsabilidades públicas asignadas a la entidad.","▪ Atiende y valora las necesidades y peticiones de los usuarios y de ciudadanos en general.\n▪Considera las necesidades de los usuarios al diseñar proyectos o servicios.\n▪Da respuesta oportuna a las necesidades de los usuarios de conformidad con el servicio que ofrece la entidad.\n▪Establece diferentes canales de comunicación con el usuario para conocer sus necesidades y propuestas y responde a las mismas.\n▪Reconoce la interdependencia entre su trabajo y el de otros.\n",null,null,null,null,null,null,null,null,null,null,null,null,null,null,null,null,null,null,null,52522559,"GUISAO","SALCEDO","LILIANA","XIMENA","Oficina Asesora Jurídica","- Grupo de Trabajo de Gestión Judicial","Oficina Asesora Jurídica - Grupo de Trabajo de Gestión Judicial","Profesional Universitario (Prov)","PROFESIONAL",2044,"05"]
[4,null,null,null,null,null,null,null,null,null,null,null,null,null,null,"2016-09-10",null,null,null,null,null,null,246,null,null,null,26.499999999999901,"NO SATISFACTORIO",null,"TÈCNICO","Compromiso con la Organización","Alinear el propio comportamiento a las necesidades, prioridades y metas organizacionales.","▪Promueve las metas de la organización y respeta sus normas.\n▪Antepone las necesidades de la organización a sus propias necesidades.\n▪Apoya a la organización en situaciones difíciles.\n▪Demuestra sentido de pertenencia en todas sus actuaciones.",null,null,null,null,null,null,null,null,null,null,null,null,null,null,null,null,null,null,null,53066719,"GUTIÉRREZ","GUTIÉRREZ","JENIFFER"," -","Dirección de Investigaciones de Protección de Usuarios de Servicios de Comunicaciones","- Grupo de Trabajo de Supervisión, Control y Vigilancia de los Regímenes de Protección de Usuarios de Servicios de Comunicaciones","Dirección de Investigaciones de Protección de Usuarios de Servicios de Comunicaciones - Grupo de Trabajo de Supervisión, Control y Vigilancia de los Regímenes de Protección de Usuarios de Servicios de Comunicaciones","Profesional Universitario (Prov)","PROFESIONAL",2044,"07"]
[5,null,null,null,null,null,null,null,null,null,null,null,null,null,null,"2016-09-11",null,null,null,null,null,null,247,null,null,null,26.599999999999898,"NO SATISFACTORIO",null,"ASISTENCIAL","Manejo de la información","Manejar con respeto las informaciones personales e institucionales de que dispone.","▪Evade temas que indagan sobre información confidencial.\n▪Recoge sólo información imprescindible para el desarrollo de la tarea.\n▪Organiza y guarda de forma adecuada la información a su cuidado, teniendo en cuenta las normas legales y de la organización.\n▪No hace pública información laboral o de las personas que pueda afectar la organización o las personas.\n",null,null,null,null,null,null,null,null,null,null,null,null,null,null,null,null,null,null,null,1130656180,"GUTIÉRREZ","SEGURA","ALEXANDRA"," -","Oficina de Servicios al Consumidor y de Apoyo Empresarial","- Grupo de Trabajo de Comunicación","Oficina de Servicios al Consumidor y de Apoyo Empresarial - Grupo de Trabajo de Comunicación","Profesional Universitario (Prov)","PROFESIONAL",2044,"03"]
[6,null,null,null,null,null,null,null,null,null,null,null,null,null,null,"2016-09-12",null,null,null,null,null,null,248,null,null,null,26.6999999999999,"NO SATISFACTORIO",null,"ASISTENCIAL","Adaptación al cambio","Enfrentarse con flexibilidad y versatilidad a situaciones nuevas para aceptar los cambios positiva y constructivamente.","▪Acepta y se adapta fácilmente los cambios.\n▪Responde al cambio con flexibilidad.\n▪Promueve el cambio.",null,null,null,null,null,null,null,null,null,null,null,null,null,null,null,null,null,null,null,29285179,"HENAO","GUTIERREZ","YESICA","JULIANA","Oficina Asesora de Planeación","- Grupo de Trabajo de Estudios Económicos","Oficina Asesora de Planeación - Grupo de Trabajo de Estudios Económicos","Profesional Universitario (Prov)","PROFESIONAL",2044,"03"]
[7,null,null,null,null,null,null,null,null,null,null,null,null,null,null,"2016-09-13",null,null,null,null,null,null,249,null,null,null,26.799999999999901,"NO SATISFACTORIO",null,"ASISTENCIAL","Disciplina","Adaptarse a las políticas institucionales y buscar información de los cambios en la autoridad competente.","▪Acepta instrucciones aunque se difiera de ellas.\n▪Realiza los cometidos y tareas del puesto de trabajo.\n▪Acepta la supervisión constante.\n▪Realiza funciones orientadas a apoyar la acción de otros miembros de la organización.",null,null,null,null,null,null,null,null,null,null,null,null,null,null,null,null,null,null,null,51833461,"HERNÁNDEZ","ALONSO","YOLANDA"," -","Despacho del Superintendente Delegado para la Protección de la Competencia","- Grupo de Trabajo de Prácticas Restrictivas de la Competencia",{"$f":"CONCATENATE(BF259,\" \",BG259)","v":"Despacho del Superintendente Delegado para la Protección de la Competencia - Grupo de Trabajo de Prácticas Restrictivas de la Competencia"},"Profesional Universitario (E)","PROFESIONAL",2044,11]
[8,null,null,null,null,null,null,null,null,null,null,null,null,null,null,"2016-09-14",null,null,null,null,null,null,250,null,null,null,26.899999999999899,"NO SATISFACTORIO",null,"ASISTENCIAL","Relaciones Interpersonales","Establecer y mantener relaciones de trabajo amistosas y positivas, basadas en la comunicación abierta y fluida y en el respeto por los demás.","▪Escucha con interés a las personas y capta las preocupaciones, intereses y necesidades de los demás.\n▪Transmite eficazmente las ideas, sentimientos e información impidiendo con ello malos entendidos o situaciones confusas que puedan generar conflictos.",null,null,null,null,null,null,null,null,null,null,null,null,null,null,null,null,null,null,null,19265118,"HERNÁNDEZ","CASTRO","ARMANDO","HUMBERTO","Despacho del Superintendente Delegado para la Protección de la Competencia","","Despacho del Superintendente Delegado para la Protección de la Competencia ","Conductor Mecánico (Prov)","ASISTENCIAL",4103,11]
[9,null,null,null,null,null,null,null,null,null,null,null,null,null,null,"2016-09-15",null,null,null,null,null,null,251,null,null,null,26.999999999999901,"NO SATISFACTORIO",null,"ASISTENCIAL","Colaboración","Cooperar con los demás con el fin de alcanzar los objetivos institucionales","▪Ayuda al logro de los objetivos articulando sus actuaciones con los demás.\n▪Cumple los compromisos que adquiere.\n▪Facilita la labor de sus superiores y compañeros de trabajo.",null,null,null,null,null,null,null,null,null,null,null,null,null,null,null,null,null,null,null,80070705,"HERNÁNDEZ","CORTÉS","ROBERT","ALEJANDRO","Dirección de Investigaciones de Protección al Consumidor","","Dirección de Investigaciones de Protección al Consumidor ","Técnico Administrativo (Prov)","TECNICO",3124,11]
[10,null,null,null,null,null,null,null,null,null,null,null,null,null,null,"2016-09-16",null,null,null,null,null,null,252,null,null,null,27.099999999999898,"NO SATISFACTORIO",null,"ASISTENCIAL","Orientación a resultados ","Realizar las funciones y cumplir los compromisos organizacionales con eficacia y calidad. ","▪ Cumple con oportunidad en función de estándares, objetivos y metas establecidas por la entidad, las funciones que le son asignadas.\n▪ Asume la responsabilidad por sus resultados.\n▪ Compromete recursos y tiempos para mejorar la productividad tomando las medidas necesarias para minimizar los riesgos.\n▪ Realiza todas las acciones necesarias para alcanzar los objetivos propuestos enfrentando los obstáculos que se presentan.",null,null,null,null,null,null,null,null,null,null,null,null,null,null,null,null,null,null,null,1032450209,"HERNÁNDEZ","DUARTE","MÓNICA","ANDREA","Oficina Asesora Jurídica","- Grupo de Trabajo de Gestión Judicial","Oficina Asesora Jurídica - Grupo de Trabajo de Gestión Judicial","Profesional Universitario (Prov)","PROFESIONAL",2044,"05"]
[11,null,null,null,null,null,null,null,null,null,null,null,null,null,null,"2016-09-17",null,null,null,null,null,null,253,null,null,null,27.1999999999999,"NO SATISFACTORIO",null,"ASISTENCIAL","Orientación al usuario y al ciudadano","Dirigir las decisiones y acciones a la satisfacción de las necesidades e intereses de los usuarios internos y externos, de conformidad con las responsabilidades públicas asignadas a la entidad.","▪ Atiende y valora las necesidades y peticiones de los usuarios y de ciudadanos en general.\n▪Considera las necesidades de los usuarios al diseñar proyectos o servicios.\n▪Da respuesta oportuna a las necesidades de los usuarios de conformidad con el servicio que ofrece la entidad.\n▪Establece diferentes canales de comunicación con el usuario para conocer sus necesidades y propuestas y responde a las mismas.\n▪Reconoce la interdependencia entre su trabajo y el de otros.\n",null,null,null,null,null,null,null,null,null,null,null,null,null,null,null,null,null,null,null,52857323,"HERNÁNDEZ","FRANCO","LINDA","MILENA","Secretaría General","- Grupo de Trabajo de Talento Humano","Secretaría General - Grupo de Trabajo de Talento Humano","Profesional Universitario (Prov)","PROFESIONAL",2044,"03"]
[12,null,null,null,null,null,null,null,null,null,null,null,null,null,null,"2016-09-18",null,null,null,null,null,null,254,null,null,null,27.299999999999901,"NO SATISFACTORIO",null,"ASISTENCIAL","Compromiso con la Organización","Alinear el propio comportamiento a las necesidades, prioridades y metas organizacionales.","▪Promueve las metas de la organización y respeta sus normas.\n▪Antepone las necesidades de la organización a sus propias necesidades.\n▪Apoya a la organización en situaciones difíciles.\n▪Demuestra sentido de pertenencia en todas sus actuaciones.",null,null,null,null,null,null,null,null,null,null,null,null,null,null,null,null,null,null,null,40326242,"HERNÁNDEZ","GÓMEZ","ANGELA","MARÍA","Dirección de Investigaciones para el Control y Verificación de Reglamentos Técnicos y Metrología Legal","- Grupo de Trabajo de Investigaciones Administrativas y Apoyo Jurídico","Dirección de Investigaciones para el Control y Verificación de Reglamentos Técnicos y Metrología Legal - Grupo de Trabajo de Investigaciones Administrativas y Apoyo Jurídico","Profesional Universitario (Prov)","PROFESIONAL",2044,"05"]
[13,null,null,null,null,null,null,null,null,null,null,null,null,null,null,"2016-09-19",null,null,null,null,null,null,255,null,null,null,27.399999999999899,"NO SATISFACTORIO",null,null,null,null,null,null,null,null,null,null,null,null,null,null,null,null,null,null,null,null,null,null,null,null,1010168937,"HERNÁNDEZ","MÁSMELA","JORGE","MARIO","Dirección Administrativa","- Grupo de Trabajo de Contratación","Dirección Administrativa - Grupo de Trabajo de Contratación","Profesional Universitario (Prov)","PROFESIONAL",2044,"07"]
[14,null,null,null,null,null,null,null,null,null,null,null,null,null,null,"2016-09-20",null,null,null,null,null,null,256,null,null,null,27.499999999999901,"NO SATISFACTORIO",null,null,null,null,null,null,null,null,null,null,null,null,null,null,null,null,null,null,null,null,null,null,null,null,52262348,"HERNÁNDEZ","REYES","LIBIA"," -","Secretaría General","- Grupo de Trabajo de Talento Humano","Secretaría General - Grupo de Trabajo de Talento Humano","Profesional Universitario (Prov)","PROFESIONAL",2044,"01"]
[15,null,null,null,null,null,null,null,null,null,null,null,null,null,null,"2016-09-21",null,null,null,null,null,null,257,null,null,null,27.599999999999898,"NO SATISFACTORIO",null,null,null,null,null,null,null,null,null,null,null,null,null,null,null,null,null,null,null,null,null,null,null,null,80214323,"HERRERA","MARTÍNEZ","JORGE","ARIEL","Dirección de Investigaciones de Protección de Usuarios de Servicios de Comunicaciones",null,"Dirección de Investigaciones de Protección de Usuarios de Servicios de Comunicaciones ","Profesional Universitario (Prov)","PROFESIONAL",2044,"01"]
[16,null,null,null,null,null,null,null,null,null,null,null,null,null,null,"2016-09-22",null,null,null,null,null,null,258,null,null,null,27.6999999999999,"NO SATISFACTORIO",null,null,null,null,null,null,null,null,null,null,null,null,null,null,null,null,null,null,null,null,null,null,null,null,79705004,"HERRERA","SAAVEDRA","JUAN","PABLO","Despacho del Superintendente","- Grupo de Trabajo de Estudios Económicos","Despacho del Superintendente - Grupo de Trabajo de Estudios Económicos","Asesor","ASESOR",1020,12]
[17,null,null,null,null,null,null,null,null,null,null,null,null,null,null,"2016-09-23",null,null,null,null,null,null,259,null,null,null,27.799999999999901,"NO SATISFACTORIO",null,null,null,null,null,null,null,null,null,null,null,null,null,null,null,null,null,null,null,null,null,null,null,null,1019045217,"HERRERA","SALAZAR","VALERIA"," -","Despacho del Superintendente Delegado para la Protección de la Competencia","- Grupo de Trabajo Interdisciplinario de Colusiones","Despacho del Superintendente Delegado para la Protección de la Competencia - Grupo de Trabajo Interdisciplinario de Colusiones","Profesional Universitario (Prov)","PROFESIONAL",2044,"03"]
[18,null,null,null,null,null,null,null,null,null,null,null,null,null,null,"2016-09-24",null,null,null,null,null,null,260,null,null,null,27.899999999999899,"NO SATISFACTORIO",null,null,null,null,null,null,null,null,null,null,null,null,null,null,null,null,null,null,null,null,null,null,null,null,1098696193,"HOYOS","GÓMEZ","SILVIA","CRISTINA","Despacho del Superintendente Delegado para Asuntos Jurisdiccionales","- Grupo de Trabajo de Defensa del Consumidor","Despacho del Superintendente Delegado para Asuntos Jurisdiccionales - Grupo de Trabajo de Defensa del Consumidor","Profesional Universitario (Prov)","PROFESIONAL",2044,"01"]
[19,null,null,null,null,null,null,null,null,null,null,null,null,null,null,"2016-09-25",null,null,null,null,null,null,261,null,null,null,27.999999999999901,"NO SATISFACTORIO",null,null,null,null,null,null,null,null,null,null,null,null,null,null,null,null,null,null,null,null,null,null,null,null,1094904554,"HOYOS","MONDRAGÓN","LAURA","MARCELA","Dirección de Investigaciones de Protección al Consumidor","- Grupo de Trabajo de Supervisión Empresarial y Seguridad de Producto","Dirección de Investigaciones de Protección al Consumidor - Grupo de Trabajo de Supervisión Empresarial y Seguridad de Producto","Profesional Universitario (Prov)","PROFESIONAL",2044,"07"]
[20,null,null,null,null,null,null,null,null,null,null,null,null,null,null,"2016-09-26",null,null,null,null,null,null,262,null,null,null,28.099999999999898,"NO SATISFACTORIO",null,null,null,null,null,null,null,null,null,null,null,null,null,null,null,null,null,null,null,null,null,null,null,null,53071326,"HUERTAS","GONZÁLEZ","BIBIANA","ANDREA","Dirección Administrativa","- Grupo de Trabajo de Gestión Documental y Recursos Físicos","Dirección Administrativa - Grupo de Trabajo de Gestión Documental y Recursos Físicos","Técnico Administrativo (Prov)","TECNICO",3124,11]
[21,null,null,null,null,null,null,null,null,null,null,null,null,null,null,"2016-09-27",null,null,null,null,null,null,263,null,null,null,28.1999999999999,"NO SATISFACTORIO",null,null,null,null,null,null,null,null,null,null,null,null,null,null,null,null,null,null,null,null,null,null,null,null,11338449,"HUERTAS","YEPES","SAMUEL","DARIO","Despacho del Superintendente Delegado para la Protección de la Competencia","- Grupo de Trabajo de Prácticas Restrictivas de la Competencia","Despacho del Superintendente Delegado para la Protección de la Competencia - Grupo de Trabajo de Prácticas Restrictivas de la Competencia","Profesional Universitario (Prov)","PROFESIONAL",2044,11]
[22,null,null,null,null,null,null,null,null,null,null,null,null,null,null,"2016-09-28",null,null,null,null,null,null,264,null,null,null,28.299999999999901,"NO SATISFACTORIO",null,null,null,null,null,null,null,null,null,null,null,null,null,null,null,null,null,null,null,null,null,null,null,null,51899290,"HURTADO","BEJARANO","AIDA","LUCIA","Dirección de Investigación de Protección de Datos Personales","- Grupo de Trabajo de Investigaciones Administrativas de Protección de Datos Personales","Dirección de Investigación de Protección de Datos Personales - Grupo de Trabajo de Investigaciones Administrativas de Protección de Datos Personales","Profesional Universitario (Prov)","PROFESIONAL",2044,"05"]
[23,null,null,null,null,null,null,null,null,null,null,null,null,null,null,"2016-09-29",null,null,null,null,null,null,265,null,null,null,28.399999999999899,"NO SATISFACTORIO",null,null,null,null,null,null,null,null,null,null,null,null,null,null,null,null,null,null,null,null,null,null,null,null,52311423,"INFANTE","BÁEZ","SONIA"," -","Dirección de Cámaras de Comercio","- Grupo de Trabajo de Trámites Administrativos","Dirección de Cámaras de Comercio - Grupo de Trabajo de Trámites Administrativos","Profesional Universitario (Prov)","PROFESIONAL",2044,11]
[24,null,null,null,null,null,null,null,null,null,null,null,null,null,null,"2016-09-30",null,null,null,null,null,null,266,null,null,null,28.499999999999901,"NO SATISFACTORIO",null,null,null,null,null,null,null,null,null,null,null,null,null,null,null,null,null,null,null,null,null,null,null,null,38364408,"JARAMILLO","LONDOÑO","ALEJANDRA","ROSALIA","Despacho del Superintendente Delegado para la Protección de la Competencia","- Grupo de Trabajo de Protección y Promoción de la Competencia","Despacho del Superintendente Delegado para la Protección de la Competencia - Grupo de Trabajo de Protección y Promoción de la Competencia","Profesional Universitario (Prov)","PROFESIONAL",2044,"05"]
[25,null,null,null,null,null,null,null,null,null,null,null,null,null,null,"2016-10-01",null,null,null,null,null,null,267,null,null,null,28.599999999999898,"NO SATISFACTORIO",null,null,null,null,null,null,null,null,null,null,null,null,null,null,null,null,null,null,null,null,null,null,null,null,1018450235,"JARAMILLO","SANZ","ANDRÉS"," -","Despacho del Superintendente Delegado para Asuntos Jurisdiccionales","- Grupo de Trabajo de Competencia Desleal y Propiedad Industrial","Despacho del Superintendente Delegado para Asuntos Jurisdiccionales - Grupo de Trabajo de Competencia Desleal y Propiedad Industrial","Profesional Universitario (Prov)","PROFESIONAL",2044,"01"]
[26,null,null,null,null,null,null,null,null,null,null,null,null,null,null,"2016-10-02",null,null,null,null,null,null,268,null,null,null,28.6999999999999,"NO SATISFACTORIO",null,null,null,null,null,null,null,null,null,null,null,null,null,null,null,null,null,null,null,null,null,null,null,null,79442366,"JARRO","TRIANA","CÉSAR","ORLANDO","Dirección de Cámaras de Comercio","- Grupo de Trabajo de Vigilancia de las Cámaras de Comercio y a los Comerciantes","Dirección de Cámaras de Comercio - Grupo de Trabajo de Vigilancia de las Cámaras de Comercio y a los Comerciantes","Profesional Universitario (Prov)","PROFESIONAL",2044,"09"]
[27,null,null,null,null,null,null,null,null,null,null,null,null,null,null,"2016-10-03",null,null,null,null,null,null,269,null,null,null,28.799999999999901,"NO SATISFACTORIO",null,null,null,null,null,null,null,null,null,null,null,null,null,null,null,null,null,null,null,null,null,null,null,null,1047392494,"JIMÉNEZ","NASSAR","ANTONIO","JOSÉ","Despacho del Superintendente Delegado para Asuntos Jurisdiccionales","- Grupo de Trabajo de Calificación","Despacho del Superintendente Delegado para Asuntos Jurisdiccionales - Grupo de Trabajo de Calificación","Profesional Universitario (Prov)","PROFESIONAL",2044,"01"]
[28,null,null,null,null,null,null,null,null,null,null,null,null,null,null,"2016-10-04",null,null,null,null,null,null,270,null,null,null,28.899999999999899,"NO SATISFACTORIO",null,null,null,null,null,null,null,null,null,null,null,null,null,null,null,null,null,null,null,null,null,null,null,null,39581635,"JIMÉNEZ","REYES","MIREYA"," -","Despacho del Superintendente Delegado para la Protección de Datos Personales","","Despacho del Superintendente Delegado para la Protección de Datos Personales ","Secretario (Prov)","ASISTENCIAL",4178,"08"]
[29,null,null,null,null,null,null,null,null,null,null,null,null,null,null,"2016-10-05",null,null,null,null,null,null,271,null,null,null,28.999999999999901,"NO SATISFACTORIO",null,null,null,null,null,null,null,null,null,null,null,null,null,null,null,null,null,null,null,null,null,null,null,null,79855513,"JIMÉNEZ","SÁNCHEZ","MARCO","ANTONIO","Despacho del Superintendente Delegado para Asuntos Jurisdiccionales","","Despacho del Superintendente Delegado para Asuntos Jurisdiccionales ","Asesor","ASESOR",1020,"04"]
[30,null,null,null,null,null,null,null,null,null,null,null,null,null,null,"2016-10-06",null,null,null,null,null,null,272,null,null,null,29.099999999999898,"NO SATISFACTORIO",null,null,null,null,null,null,null,null,null,null,null,null,null,null,null,null,null,null,null,null,null,null,null,null,51997082,"LADINO","ROMERO","DAISY","ELIANA","Oficina Asesora Jurídica","- Grupo de Trabajo de Cobro Coactivo","Oficina Asesora Jurídica - Grupo de Trabajo de Cobro Coactivo","Secretario Ejecutivo (E)","ASISTENCIAL",4210,16]
[31,null,null,null,null,null,null,null,null,null,null,null,null,null,null,"2016-10-07",null,null,null,null,null,null,273,null,null,null,29.1999999999999,"NO SATISFACTORIO",null,null,null,null,null,null,null,null,null,null,null,null,null,null,null,null,null,null,null,null,null,null,null,null,51984933,"LAMUS","BECERRA","MARÍA","JOSÉ","Dirección de Signos Distintivos","","Dirección de Signos Distintivos ","Director de Superintendencia","DIRECTIVO","0105",11]
[32,null,null,null,null,null,null,null,null,null,null,null,null,null,null,"2016-10-08",null,null,null,null,null,null,274,null,null,null,29.299999999999901,"NO SATISFACTORIO",null,null,null,null,null,null,null,null,null,null,null,null,null,null,null,null,null,null,null,null,null,null,null,null,52262499,"LARA","VARGAS","INGRID","YOLANDA","Despacho del Superintendente","","Despacho del Superintendente ","Secretario Ejecutivo","ASISTENCIAL",4210,18]
[33,null,null,null,null,null,null,null,null,null,null,null,null,null,null,"2016-10-09",null,null,null,null,null,null,275,null,null,null,29.399999999999899,"NO SATISFACTORIO",null,null,null,null,null,null,null,null,null,null,null,null,null,null,null,null,null,null,null,null,null,null,null,null,1020733476,"LARGO","MARIN","EDISON","CAMILO","Despacho del Superintendente Delegado para Asuntos Jurisdiccionales","- Grupo de Trabajo de Defensa del Consumidor","Despacho del Superintendente Delegado para Asuntos Jurisdiccionales - Grupo de Trabajo de Defensa del Consumidor","Profesional Universitario (Prov)","PROFESIONAL",2044,"09"]
[34,null,null,null,null,null,null,null,null,null,null,null,null,null,null,"2016-10-10",null,null,null,null,null,null,276,null,null,null,29.499999999999901,"NO SATISFACTORIO",null,null,null,null,null,null,null,null,null,null,null,null,null,null,null,null,null,null,null,null,null,null,null,null,33197699,"LASTRE","AGUAS","LUZMILA","ELENA","Despacho del Superintendente Delegado para Asuntos Jurisdiccionales","- Grupo de Trabajo de Calificación","Despacho del Superintendente Delegado para Asuntos Jurisdiccionales - Grupo de Trabajo de Calificación","Profesional Universitario (E)","PROFESIONAL",2044,10]
[35,null,null,null,null,null,null,null,null,null,null,null,null,null,null,"2016-10-11",null,null,null,null,null,null,277,null,null,null,29.599999999999898,"NO SATISFACTORIO",null,null,null,null,null,null,null,null,null,null,null,null,null,null,null,null,null,null,null,null,null,null,null,null,1022334868,"LATORRE","RUIZ","YEISON","HUMBERTO","Oficina de Tecnología e Informática","- Grupo de Trabajo de Infraestructura Tecnológica y Seguridad","Oficina de Tecnología e Informática - Grupo de Trabajo de Infraestructura Tecnológica y Seguridad","Profesional Universitario (Prov)","PROFESIONAL",2044,"01"]
[36,null,null,null,null,null,null,null,null,null,null,null,null,null,null,"2016-10-12",null,null,null,null,null,null,278,null,null,null,29.6999999999999,"NO SATISFACTORIO",null,null,null,null,null,null,null,null,null,null,null,null,null,null,null,null,null,null,null,null,null,null,null,null,46451208,"LEGUIZAMÓN","LEGUIZAMÓN","CONSUELO"," -","Despacho del Superintendente Delegado para la Propiedad Industrial","- Grupo de Trabajo de Vía Gubernativa","Despacho del Superintendente Delegado para la Propiedad Industrial - Grupo de Trabajo de Vía Gubernativa","Profesional Universitario (Prov)","PROFESIONAL",2044,"09"]
[37,null,null,null,null,null,null,null,null,null,null,null,null,null,null,"2016-10-13",null,null,null,null,null,null,279,null,null,null,29.799999999999901,"NO SATISFACTORIO",null,null,null,null,null,null,null,null,null,null,null,null,null,null,null,null,null,null,null,null,null,null,null,null,79411919,"LEMUS","GIRALDO","CARLOS","DANIEL","Despacho del Superintendente Delegado para la Propiedad Industrial","- Grupo de Trabajo de Vía Gubernativa","Despacho del Superintendente Delegado para la Propiedad Industrial - Grupo de Trabajo de Vía Gubernativa","Profesional Universitario (Prov)","PROFESIONAL",2044,"09"]
[38,null,null,null,null,null,null,null,null,null,null,null,null,null,null,"2016-10-14",null,null,null,null,null,null,280,null,null,null,29.899999999999899,"NO SATISFACTORIO",null,null,null,null,null,null,null,null,null,null,null,null,null,null,null,null,null,null,null,null,null,null,null,null,52073410,"LEMUS","QUIROGA","ALBA","ROCÍO","Dirección de Nuevas Creaciones","- Grupo de Trabajo del Sector de Ingenierías","Dirección de Nuevas Creaciones - Grupo de Trabajo del Sector de Ingenierías","Profesional Universitario (Prov)","PROFESIONAL",2044,"01"]
[39,null,null,null,null,null,null,null,null,null,null,null,null,null,null,"2016-10-15",null,null,null,null,null,null,281,null,null,null,29.999999999999901,"NO SATISFACTORIO",null,null,null,null,null,null,null,null,null,null,null,null,null,null,null,null,null,null,null,null,null,null,null,null,79236931,"LEÓN","BUITRAGO","JUAN","MANUEL","Secretaría General","","Secretaría General ","Conductor Mecánico (Prov)","ASISTENCIAL",4103,"09"]
[40,null,null,null,null,null,null,null,null,null,null,null,null,null,null,"2016-10-16",null,null,null,null,null,null,282,null,null,null,30.099999999999898,"NO SATISFACTORIO",null,null,null,null,null,null,null,null,null,null,null,null,null,null,null,null,null,null,null,null,null,null,null,null,80198254,"LEÓN","RUEDA","ISMAEL","ALBERTO GUSTAVO RODRIGO MACARIO","Dirección de Signos Distintivos","","Dirección de Signos Distintivos ","Profesional Universitario (Prov)","PROFESIONAL",2044,"05"]
[41,null,null,null,null,null,null,null,null,null,null,null,null,null,null,"2016-10-17",null,null,null,null,null,null,283,null,null,null,30.1999999999999,"NO SATISFACTORIO",null,null,null,null,null,null,null,null,null,null,null,null,null,null,null,null,null,null,null,null,null,null,null,null,52694019,"LIÉVANO","LIÉVANO","CAROLINA"," -","Despacho del Superintendente","","Despacho del Superintendente ","Asesor","ASESOR",1020,"04"]
[42,null,null,null,null,null,null,null,null,null,null,null,null,null,null,"2016-10-18",null,null,null,null,null,null,284,null,null,null,30.299999999999901,"NO SATISFACTORIO",null,null,null,null,null,null,null,null,null,null,null,null,null,null,null,null,null,null,null,null,null,null,null,null,88282280,"LOBO","VELÁSQUEZ","YERSON","DANILO","Despacho del Superintendente Delegado para Asuntos Jurisdiccionales","- Grupo de Trabajo para la Verificación del Cumplimiento","Despacho del Superintendente Delegado para Asuntos Jurisdiccionales - Grupo de Trabajo para la Verificación del Cumplimiento","Profesional Universitario (Prov)","PROFESIONAL",2044,"01"]
[43,null,null,null,null,null,null,null,null,null,null,null,null,null,null,"2016-10-19",null,null,null,null,null,null,285,null,null,null,30.399999999999899,"NO SATISFACTORIO",null,null,null,null,null,null,null,null,null,null,null,null,null,null,null,null,null,null,null,null,null,null,null,null,7706417,"LONDOÑO","FERNÁNDEZ","JOSÉ","LUIS","Despacho del Superintendente Delegado para la Propiedad Industrial","","Despacho del Superintendente Delegado para la Propiedad Industrial ","Superintendente Delegado","DIRECTIVO","0110",19]
[44,null,null,null,null,null,null,null,null,null,null,null,null,null,null,"2016-10-20",null,null,null,null,null,null,286,null,null,null,30.499999999999901,"NO SATISFACTORIO",null,null,null,null,null,null,null,null,null,null,null,null,null,null,null,null,null,null,null,null,null,null,null,null,51957159,"LÓPEZ","CHAVEZ","JAROSLAV","MARLEN","Oficina de Tecnología e Informática","- Grupo de Trabajo de Gestión de Información y Proyectos Informáticos","Oficina de Tecnología e Informática - Grupo de Trabajo de Gestión de Información y Proyectos Informáticos","Profesional Universitario (E)","PROFESIONAL",2044,11]
[45,null,null,null,null,null,null,null,null,null,null,null,null,null,null,"2016-10-21",null,null,null,null,null,null,287,null,null,null,30.599999999999898,"NO SATISFACTORIO",null,null,null,null,null,null,null,null,null,null,null,null,null,null,null,null,null,null,null,null,null,null,null,null,52847230,"LÓPEZ","OÑATE","CLAUDIA","MILENA","Despacho del Superintendente Delegado para la Protección de la Competencia",null,"Despacho del Superintendente Delegado para la Protección de la Competencia ","Profesional Universitario (Prov)","PROFESIONAL",2044,11]
[46,null,null,null,null,null,null,null,null,null,null,null,null,null,null,"2016-10-22",null,null,null,null,null,null,288,null,null,null,30.6999999999999,"NO SATISFACTORIO",null,null,null,null,null,null,null,null,null,null,null,null,null,null,null,null,null,null,null,null,null,null,null,null,52081649,"LÓPEZ","SANABRIA","BLANCA","LILIANA","Dirección de Cámaras de Comercio","- Grupo de Trabajo de Vigilancia de las Cámaras de Comercio y a los Comerciantes","Dirección de Cámaras de Comercio - Grupo de Trabajo de Vigilancia de las Cámaras de Comercio y a los Comerciantes","Profesional Universitario (Prov)","PROFESIONAL",2044,"07"]
[47,null,null,null,null,null,null,null,null,null,null,null,null,null,null,"2016-10-23",null,null,null,null,null,null,289,null,null,null,30.799999999999901,"NO SATISFACTORIO",null,null,null,null,null,null,null,null,null,null,null,null,null,null,null,null,null,null,null,null,null,null,null,null,79524455,"LÓPEZ","SIERRA","OSCAR"," -","Dirección Administrativa","- Grupo de Trabajo de Gestión Documental y Recursos Físicos","Dirección Administrativa - Grupo de Trabajo de Gestión Documental y Recursos Físicos","Técnico Administrativo (Prov)","TECNICO",3124,"09"]
[48,null,null,null,null,null,null,null,null,null,null,null,null,null,null,"2016-10-24",null,null,null,null,null,null,290,null,null,null,30.899999999999899,"NO SATISFACTORIO",null,null,null,null,null,null,null,null,null,null,null,null,null,null,null,null,null,null,null,null,null,null,null,null,12193107,"LOSADA","CALDERÓN","JUAN","CARLOS","Dirección de Cámaras de Comercio","- Grupo de Trabajo de Vigilancia de las Cámaras de Comercio y a los Comerciantes","Dirección de Cámaras de Comercio - Grupo de Trabajo de Vigilancia de las Cámaras de Comercio y a los Comerciantes","Profesional Universitario (Prov)","PROFESIONAL",2044,"03"]
[49,null,null,null,null,null,null,null,null,null,null,null,null,null,null,"2016-10-25",null,null,null,null,null,null,291,null,null,null,30.999999999999901,"NO SATISFACTORIO",null,null,null,null,null,null,null,null,null,null,null,null,null,null,null,null,null,null,null,null,null,null,null,null,1018429764,"LOTERO","PRADA","JOHANNA","PATRICIA","Despacho del Superintendente Delegado para Asuntos Jurisdiccionales","- Grupo de Trabajo de Competencia Desleal y Propiedad Industrial","Despacho del Superintendente Delegado para Asuntos Jurisdiccionales - Grupo de Trabajo de Competencia Desleal y Propiedad Industrial","Profesional Universitario (Prov)","PROFESIONAL",2044,"07"]
[50,null,null,null,null,null,null,null,null,null,null,null,null,null,null,"2016-10-26",null,null,null,null,null,null,292,null,null,null,31.099999999999898,"NO SATISFACTORIO",null,null,null,null,null,null,null,null,null,null,null,null,null,null,null,null,null,null,null,null,null,null,null,null,53114754,"LOZANO","BARÓN","LENNYS","LORENA","Despacho del Superintendente Delegado para Asuntos Jurisdiccionales","- Grupo de Trabajo de Defensa del Consumidor","Despacho del Superintendente Delegado para Asuntos Jurisdiccionales - Grupo de Trabajo de Defensa del Consumidor","Profesional Universitario (Prov)","PROFESIONAL",2044,"01"]
[51,null,null,null,null,null,null,null,null,null,null,null,null,null,null,"2016-10-27",null,null,null,null,null,null,293,null,null,null,31.1999999999999,"NO SATISFACTORIO",null,null,null,null,null,null,null,null,null,null,null,null,null,null,null,null,null,null,null,null,null,null,null,null,53012195,"LOZANO","DÍAZ","ERIKA","YOHANA","Oficina de Tecnología e Informática",null,"Oficina de Tecnología e Informática ","Profesional Universitario (Prov)","PROFESIONAL",2044,"09"]
[52,null,null,null,null,null,null,null,null,null,null,null,null,null,null,"2016-10-28",null,null,null,null,null,null,294,null,null,null,31.299999999999901,"NO SATISFACTORIO",null,null,null,null,null,null,null,null,null,null,null,null,null,null,null,null,null,null,null,null,null,null,null,null,79944885,"LOZANO","GUZMÁN","JUAN","DAVID","Dirección Administrativa","- Grupo de Trabajo de Contratación","Dirección Administrativa - Grupo de Trabajo de Contratación","Profesional Universitario (Prov)","PROFESIONAL",2044,"05"]
[53,null,null,null,null,null,null,null,null,null,null,null,null,null,null,"2016-10-29",null,null,null,null,null,null,295,null,null,null,31.399999999999899,"NO SATISFACTORIO",null,null,null,null,null,null,null,null,null,null,null,null,null,null,null,null,null,null,null,null,null,null,null,null,51778598,"LOZANO","ROMERO","MARÍA","BEATRIZ","Despacho del Superintendente Delegado para la Propiedad Industrial",null,"Despacho del Superintendente Delegado para la Propiedad Industrial ","Secretario (E)","ASISTENCIAL",4178,13]
[54,null,null,null,null,null,null,null,null,null,null,null,null,null,null,"2016-10-30",null,null,null,null,null,null,296,null,null,null,31.499999999999901,"NO SATISFACTORIO",null,null,null,null,null,null,null,null,null,null,null,null,null,null,null,null,null,null,null,null,null,null,null,null,1032448057,"LUGO","ROZO","CINDY","CAROLINA","Despacho del Superintendente Delegado para la Protección de la Competencia","- Grupo de Trabajo de Integraciones Empresariales","Despacho del Superintendente Delegado para la Protección de la Competencia - Grupo de Trabajo de Integraciones Empresariales","Técnico Administrativo (Prov)","TECNICO",3124,11]
[55,null,null,null,null,null,null,null,null,null,null,null,null,null,null,"2016-10-31",null,null,null,null,null,null,297,null,null,null,31.599999999999898,"NO SATISFACTORIO",null,null,null,null,null,null,null,null,null,null,null,null,null,null,null,null,null,null,null,null,null,null,null,null,1030551503,"MALDONADO","NOVA","VICTOR"," -","Oficina Asesora de Planeación",null,"Oficina Asesora de Planeación ","Profesional Universitario (Prov)","PROFESIONAL",2044,"01"]
[56,null,null,null,null,null,null,null,null,null,null,null,null,null,null,"2016-11-01",null,null,null,null,null,null,298,null,null,null,31.6999999999999,"NO SATISFACTORIO",null,null,null,null,null,null,null,null,null,null,null,null,null,null,null,null,null,null,null,null,null,null,null,null,41649413,"MANCERA","SIERRA","MYRIAM","LUCÍA","Dirección de Cámaras de Comercio","- Grupo de Trabajo de Vigilancia de las Cámaras de Comercio y a los Comerciantes","Dirección de Cámaras de Comercio - Grupo de Trabajo de Vigilancia de las Cámaras de Comercio y a los Comerciantes","Profesional Especializado (E)","PROFESIONAL",2028,13]
[57,null,null,null,null,null,null,null,null,null,null,null,null,null,null,"2016-11-02",null,null,null,null,null,null,299,null,null,null,31.799999999999901,"NO SATISFACTORIO",null,null,null,null,null,null,null,null,null,null,null,null,null,null,null,null,null,null,null,null,null,null,null,null,1075262531,"MARÍN","ROA","MARÍA","CAMILA","Dirección de Investigaciones de Protección de Usuarios de Servicios de Comunicaciones","- Grupo de Trabajo de Investigaciones Administrativas de Protección de Usuarios de Servicios de Comunicaciones","Dirección de Investigaciones de Protección de Usuarios de Servicios de Comunicaciones - Grupo de Trabajo de Investigaciones Administrativas de Protección de Usuarios de Servicios de Comunicaciones","Profesional Universitario (Prov)","PROFESIONAL",2044,"01"]
[58,null,null,null,null,null,null,null,null,null,null,null,null,null,null,"2016-11-03",null,null,null,null,null,null,300,null,null,null,31.899999999999899,"NO SATISFACTORIO",null,null,null,null,null,null,null,null,null,null,null,null,null,null,null,null,null,null,null,null,null,null,null,null,52520440,"MARÍN","RODRÍGUEZ","JORDY","TATIANA","Despacho del Superintendente Delegado para Asuntos Jurisdiccionales","- Grupo de Trabajo de Secretaría","Despacho del Superintendente Delegado para Asuntos Jurisdiccionales - Grupo de Trabajo de Secretaría","Auxiliar Administrativo (Prov)","ASISTENCIAL",4044,"08"]
[59,null,null,null,null,null,null,null,null,null,null,null,null,null,null,"2016-11-04",null,null,null,null,null,null,301,null,null,null,31.999999999999901,"NO SATISFACTORIO",null,null,null,null,null,null,null,null,null,null,null,null,null,null,null,null,null,null,null,null,null,null,null,null,53065143,"MARÍN","YEPES","ERIKA","MARCELA","Despacho del Superintendente Delegado para la Protección de la Competencia","- Grupo de Trabajo de Protección y Promoción de la Competencia","Despacho del Superintendente Delegado para la Protección de la Competencia - Grupo de Trabajo de Protección y Promoción de la Competencia","Profesional Universitario (Prov)","PROFESIONAL",2044,"05"]
[60,null,null,null,null,null,null,null,null,null,null,null,null,null,null,"2016-11-05",null,null,null,null,null,null,302,null,null,null,32.099999999999902,"NO SATISFACTORIO",null,null,null,null,null,null,null,null,null,null,null,null,null,null,null,null,null,null,null,null,null,null,null,null,51912405,"MARIÑO","LÓPEZ","DIANA","CRISTINA","Oficina de Servicios al Consumidor y de Apoyo Empresarial","- Grupo de Trabajo de Comunicación","Oficina de Servicios al Consumidor y de Apoyo Empresarial - Grupo de Trabajo de Comunicación","Profesional Especializado (E)","PROFESIONAL",2028,13]
[61,null,null,null,null,null,null,null,null,null,null,null,null,null,null,"2016-11-06",null,null,null,null,null,null,303,null,null,null,32.199999999999903,"NO SATISFACTORIO",null,null,null,null,null,null,null,null,null,null,null,null,null,null,null,null,null,null,null,null,null,null,null,null,52251306,"MARTÍ","SAMPER","MARÍA","DEL PILAR","Oficina de Servicios al Consumidor y de Apoyo Empresarial","- Grupo de Trabajo de Atención al Ciudadano","Oficina de Servicios al Consumidor y de Apoyo Empresarial - Grupo de Trabajo de Atención al Ciudadano","Profesional Especializado (Prov)","PROFESIONAL",2028,13]
[62,null,null,null,null,null,null,null,null,null,null,null,null,null,null,"2016-11-07",null,null,null,null,null,null,304,null,null,null,32.299999999999898,"NO SATISFACTORIO",null,null,null,null,null,null,null,null,null,null,null,null,null,null,null,null,null,null,null,null,null,null,null,null,39535783,"MARTÍN","CARRILLO","MARÍA","ANTONIA","Dirección Financiera",null,"Dirección Financiera ","Técnico Administrativo (E)","TECNICO",3124,11]
[63,null,null,null,null,null,null,null,null,null,null,null,null,null,null,"2016-11-08",null,null,null,null,null,null,305,null,null,null,32.399999999999899,"NO SATISFACTORIO",null,null,null,null,null,null,null,null,null,null,null,null,null,null,null,null,null,null,null,null,null,null,null,null,53048021,"MARTÍN","MARTÍNEZ","DIANA","CAROLINA","Despacho del Superintendente Delegado para la Protección del Consumidor",null,"Despacho del Superintendente Delegado para la Protección del Consumidor ","Profesional Universitario (Prov)","PROFESIONAL",2044,"09"]
[64,null,null,null,null,null,null,null,null,null,null,null,null,null,null,"2016-11-09",null,null,null,null,null,null,306,null,null,null,32.499999999999901,"NO SATISFACTORIO",null,null,null,null,null,null,null,null,null,null,null,null,null,null,null,null,null,null,null,null,null,null,null,null,4443386,"MARTÍNEZ","ARIAS","ALBERTO","LEÓN","Oficina Asesora Jurídica","- Grupo de Trabajo de Gestión Judicial","Oficina Asesora Jurídica - Grupo de Trabajo de Gestión Judicial","Técnico Administrativo (Prov)","TECNICO",3124,11]
[65,null,null,null,null,null,null,null,null,null,null,null,null,null,null,"2016-11-10",null,null,null,null,null,null,307,null,null,null,32.599999999999902,"NO SATISFACTORIO",null,null,null,null,null,null,null,null,null,null,null,null,null,null,null,null,null,null,null,null,null,null,null,null,52291168,"MARTÍNEZ","CASTRO","JANNETH","EMILSE","Despacho del Superintendente Delegado para la Propiedad Industrial",null,"Despacho del Superintendente Delegado para la Propiedad Industrial ","Profesional Universitario (E)","PROFESIONAL",2044,"09"]
[66,null,null,null,null,null,null,null,null,null,null,null,null,null,null,"2016-11-11",null,null,null,null,null,null,308,null,null,null,32.699999999999903,"NO SATISFACTORIO",null,null,null,null,null,null,null,null,null,null,null,null,null,null,null,null,null,null,null,null,null,null,null,null,35328747,"MARTÍNEZ","GÓMEZ","PATRICIA","VIRGINIA DE LAS MERCEDES","Despacho del Superintendente Delegado para la Protección de la Competencia","- Grupo de Trabajo de Abogacía de la Competencia","Despacho del Superintendente Delegado para la Protección de la Competencia - Grupo de Trabajo de Abogacía de la Competencia","Secretario Ejecutivo (E)","ASISTENCIAL",4210,18]
[67,null,null,null,null,null,null,null,null,null,null,null,null,null,null,"2016-11-12",null,null,null,null,null,null,309,null,null,null,32.799999999999898,"NO SATISFACTORIO",null,null,null,null,null,null,null,null,null,null,null,null,null,null,null,null,null,null,null,null,null,null,null,null,1136879750,"MARTÍNEZ","HERRERA","JESSICA","MELISA","Dirección de Signos Distintivos","- Grupo de Trabajo de Registro","Dirección de Signos Distintivos - Grupo de Trabajo de Registro","Profesional Universitario (Prov)","PROFESIONAL",2044,"01"]
[68,null,null,null,null,null,null,null,null,null,null,null,null,null,null,"2016-11-13",null,null,null,null,null,null,310,null,null,null,32.899999999999899,"NO SATISFACTORIO",null,null,null,null,null,null,null,null,null,null,null,null,null,null,null,null,null,null,null,null,null,null,null,null,91537347,"MARTÍNEZ","LUNA","HUGO","ALBERTO","Despacho del Superintendente Delegado para Asuntos Jurisdiccionales","- Grupo de Trabajo de Competencia Desleal y Propiedad Industrial","Despacho del Superintendente Delegado para Asuntos Jurisdiccionales - Grupo de Trabajo de Competencia Desleal y Propiedad Industrial","Profesional Universitario (Prov)","PROFESIONAL",2044,"01"]
[69,null,null,null,null,null,null,null,null,null,null,null,null,null,null,"2016-11-14",null,null,null,null,null,null,311,null,null,null,32.999999999999901,"NO SATISFACTORIO",null,null,null,null,null,null,null,null,null,null,null,null,null,null,null,null,null,null,null,null,null,null,null,null,52029154,"MATEUS","SALINAS","MARTHA","PATRICIA DEL ROCIO","Oficina de Servicios al Consumidor y de Apoyo Empresarial","- Grupo de Trabajo Aula de Propiedad Industrial","Oficina de Servicios al Consumidor y de Apoyo Empresarial - Grupo de Trabajo Aula de Propiedad Industrial","Profesional Universitario (Prov)","PROFESIONAL",2044,"05"]
[70,null,null,null,null,null,null,null,null,null,null,null,null,null,null,"2016-11-15",null,null,null,null,null,null,312,null,null,null,33.099999999999902,"NO SATISFACTORIO",null,null,null,null,null,null,null,null,null,null,null,null,null,null,null,null,null,null,null,null,null,null,null,null,52148349,"MATIZ","BERNAL","LILIANA"," -","Dirección de Signos Distintivos","- Grupo de Trabajo de Forma","Dirección de Signos Distintivos - Grupo de Trabajo de Forma","Profesional Universitario (Prov)","PROFESIONAL",2044,"01"]
[71,null,null,null,null,null,null,null,null,null,null,null,null,null,null,"2016-11-16",null,null,null,null,null,null,313,null,null,null,33.199999999999903,"NO SATISFACTORIO",null,null,null,null,null,null,null,null,null,null,null,null,null,null,null,null,null,null,null,null,null,null,null,null,1049615565,"MEDINA","GÓMEZ","CAMILA","ANDREA","Despacho del Superintendente Delegado para Asuntos Jurisdiccionales","- Grupo de Trabajo de Defensa del Consumidor",{"$f":"CONCATENATE(BF323,\" \",BG323)","v":"Despacho del Superintendente Delegado para Asuntos Jurisdiccionales - Grupo de Trabajo de Defensa del Consumidor"},"Profesional Universitario (Prov)","PROFESIONAL",2044,"05"]
[72,null,null,null,null,null,null,null,null,null,null,null,null,null,null,"2016-11-17",null,null,null,null,null,null,314,null,null,null,33.299999999999898,"NO SATISFACTORIO",null,null,null,null,null,null,null,null,null,null,null,null,null,null,null,null,null,null,null,null,null,null,null,null,51872624,"MEDINA","RODRÍGUEZ","MARTHA","YLIANA","Dirección de Signos Distintivos",null,"Dirección de Signos Distintivos ","Técnico Administrativo (E)","TECNICO",3124,11]
[73,null,null,null,null,null,null,null,null,null,null,null,null,null,null,"2016-11-18",null,null,null,null,null,null,315,null,null,null,33.399999999999899,"NO SATISFACTORIO",null,null,null,null,null,null,null,null,null,null,null,null,null,null,null,null,null,null,null,null,null,null,null,null,52783508,"MEJIA","HOYOS","PAOLA","ANDREA","Oficina de Servicios al Consumidor y de Apoyo Empresarial","- Grupo de Trabajo Aula de Propiedad Industrial","Oficina de Servicios al Consumidor y de Apoyo Empresarial - Grupo de Trabajo Aula de Propiedad Industrial","Profesional Universitario (Prov)","PROFESIONAL",2044,10]
[74,null,null,null,null,null,null,null,null,null,null,null,null,null,null,"2016-11-19",null,null,null,null,null,null,316,null,null,null,33.499999999999901,"NO SATISFACTORIO",null,null,null,null,null,null,null,null,null,null,null,null,null,null,null,null,null,null,null,null,null,null,null,null,80740621,"MELO","RODRÍGUEZ","FRANCISCO"," -","Despacho del Superintendente Delegado para la Protección de la Competencia","- Grupo de Trabajo de Protección y Promoción de la Competencia","Despacho del Superintendente Delegado para la Protección de la Competencia - Grupo de Trabajo de Protección y Promoción de la Competencia","Profesional Especializado (Prov)","PROFESIONAL",2028,17]
[75,null,null,null,null,null,null,null,null,null,null,null,null,null,null,"2016-11-20",null,null,null,null,null,null,317,null,null,null,33.599999999999902,"NO SATISFACTORIO",null,null,null,null,null,null,null,null,null,null,null,null,null,null,null,null,null,null,null,null,null,null,null,null,79115746,"MELO","VARGAS","JUAN","OTTO","Dirección Administrativa","- Grupo de Trabajo de Gestión Documental y Recursos Físicos","Dirección Administrativa - Grupo de Trabajo de Gestión Documental y Recursos Físicos","Profesional Universitario (Prov)","PROFESIONAL",2044,"05"]
[76,null,null,null,null,null,null,null,null,null,null,null,null,null,null,"2016-11-21",null,null,null,null,null,null,318,null,null,null,33.699999999999903,"NO SATISFACTORIO",null,null,null,null,null,null,null,null,null,null,null,null,null,null,null,null,null,null,null,null,null,null,null,null,1077453606,"MENA","ANGULO","JEFFERSON"," -","Despacho del Superintendente Delegado para Asuntos Jurisdiccionales","- Grupo de Trabajo de Calificación","Despacho del Superintendente Delegado para Asuntos Jurisdiccionales - Grupo de Trabajo de Calificación","Profesional Universitario (Prov)","PROFESIONAL",2044,"01"]
[77,null,null,null,null,null,null,null,null,null,null,null,null,null,null,"2016-11-22",null,null,null,null,null,null,319,null,null,null,33.799999999999898,"NO SATISFACTORIO",null,null,null,null,null,null,null,null,null,null,null,null,null,null,null,null,null,null,null,null,null,null,null,null,51658558,"MÉNDEZ","SERRANO","JENNY","PATRICIA","Despacho del Superintendente Delegado para Asuntos Jurisdiccionales","- Grupo de Trabajo de Defensa del Consumidor","Despacho del Superintendente Delegado para Asuntos Jurisdiccionales - Grupo de Trabajo de Defensa del Consumidor","Profesional Especializado (E)","PROFESIONAL",2028,17]
[78,null,null,null,null,null,null,null,null,null,null,null,null,null,null,"2016-11-23",null,null,null,null,null,null,320,null,null,null,33.899999999999899,"NO SATISFACTORIO",null,null,null,null,null,null,null,null,null,null,null,null,null,null,null,null,null,null,null,null,null,null,null,null,52952174,"MENDOZA","RUBIANO","LUZ","ELENA","Dirección de Investigaciones de Protección al Consumidor","","Dirección de Investigaciones de Protección al Consumidor ","Profesional Universitario (Prov)","PROFESIONAL",2044,"07"]
[79,null,null,null,null,null,null,null,null,null,null,null,null,null,null,"2016-11-24",null,null,null,null,null,null,321,null,null,null,33.999999999999901,"NO SATISFACTORIO",null,null,null,null,null,null,null,null,null,null,null,null,null,null,null,null,null,null,null,null,null,null,null,null,52551712,"MENESES","GÓMEZ","CLAUDIA","YANETH","Oficina de Tecnología e Informática",null,"Oficina de Tecnología e Informática ","Técnico Administrativo (Prov)","TECNICO",3124,"09"]
[80,null,null,null,null,null,null,null,null,null,null,null,null,null,null,"2016-11-25",null,null,null,null,null,null,322,null,null,null,34.099999999999902,"NO SATISFACTORIO",null,null,null,null,null,null,null,null,null,null,null,null,null,null,null,null,null,null,null,null,null,null,null,null,80441379,"MOLANO","HERNÁNDEZ","JOHN","EDWARD","Oficina de Tecnología e Informática","- Grupo de Trabajo de Infraestructura Tecnológica y Seguridad","Oficina de Tecnología e Informática - Grupo de Trabajo de Infraestructura Tecnológica y Seguridad","Profesional Universitario (Prov)","PROFESIONAL",2044,"09"]
[81,null,null,null,null,null,null,null,null,null,null,null,null,null,null,"2016-11-26",null,null,null,null,null,null,323,null,null,null,34.199999999999903,"NO SATISFACTORIO",null,null,null,null,null,null,null,null,null,null,null,null,null,null,null,null,null,null,null,null,null,null,null,null,52556474,"MOLINA","SÁNCHEZ","SANDRA","YANETH","Despacho del Superintendente Delegado para Asuntos Jurisdiccionales","","Despacho del Superintendente Delegado para Asuntos Jurisdiccionales ","Secretario (Prov)","ASISTENCIAL",4178,"08"]
[82,null,null,null,null,null,null,null,null,null,null,null,null,null,null,"2016-11-27",null,null,null,null,null,null,324,null,null,null,34.299999999999898,"NO SATISFACTORIO",null,null,null,null,null,null,null,null,null,null,null,null,null,null,null,null,null,null,null,null,null,null,null,null,1014238291,"MONROY","OSSA","LUISA","FERNANDA","Despacho del Superintendente Delegado para Asuntos Jurisdiccionales","- Grupo de Trabajo de Secretaría","Despacho del Superintendente Delegado para Asuntos Jurisdiccionales - Grupo de Trabajo de Secretaría","Técnico Administrativo (Prov)","TECNICO",3124,"09"]
[83,null,null,null,null,null,null,null,null,null,null,null,null,null,null,"2016-11-28",null,null,null,null,null,null,325,null,null,null,34.399999999999899,"NO SATISFACTORIO",null,null,null,null,null,null,null,null,null,null,null,null,null,null,null,null,null,null,null,null,null,null,null,null,1136879392,"MONTES","DE","EMETERIO","JOSÉ","Dirección de Investigaciones de Protección al Consumidor","","Dirección de Investigaciones de Protección al Consumidor ","Profesional Universitario (Prov)","PROFESIONAL",2044,"03"]
[84,null,null,null,null,null,null,null,null,null,null,null,null,null,null,"2016-11-29",null,null,null,null,null,null,326,null,null,null,34.499999999999901,"NO SATISFACTORIO",null,null,null,null,null,null,null,null,null,null,null,null,null,null,null,null,null,null,null,null,null,null,null,null,1070305686,"MONTES","VANEGAS","NELCY","LORENA","Dirección de Nuevas Creaciones","- Grupo de Trabajo del Sector de Ingenierías","Dirección de Nuevas Creaciones - Grupo de Trabajo del Sector de Ingenierías","Profesional Universitario (Prov)","PROFESIONAL",2044,"01"]
[85,null,null,null,null,null,null,null,null,null,null,null,null,null,null,"2016-11-30",null,null,null,null,null,null,327,null,null,null,34.599999999999902,"NO SATISFACTORIO",null,null,null,null,null,null,null,null,null,null,null,null,null,null,null,null,null,null,null,null,null,null,null,null,52983622,"MONTOYA","CASTILLO","XIOMARA"," -","Despacho del Superintendente Delegado para Asuntos Jurisdiccionales","- Grupo de Trabajo de Defensa del Consumidor","Despacho del Superintendente Delegado para Asuntos Jurisdiccionales - Grupo de Trabajo de Defensa del Consumidor","Profesional Universitario (Prov)","PROFESIONAL",2044,"01"]
[86,null,null,null,null,null,null,null,null,null,null,null,null,null,null,"2016-12-01",null,null,null,null,null,null,328,null,null,null,34.699999999999903,"NO SATISFACTORIO",null,null,null,null,null,null,null,null,null,null,null,null,null,null,null,null,null,null,null,null,null,null,null,null,1069725760,"MOR","GARCÍA","DANIEL"," -","Dirección de Signos Distintivos","- Grupo de Trabajo de Forma","Dirección de Signos Distintivos - Grupo de Trabajo de Forma","Profesional Universitario (Prov)","PROFESIONAL",2044,"03"]
[87,null,null,null,null,null,null,null,null,null,null,null,null,null,null,"2016-12-02",null,null,null,null,null,null,329,null,null,null,34.799999999999898,"NO SATISFACTORIO",null,null,null,null,null,null,null,null,null,null,null,null,null,null,null,null,null,null,null,null,null,null,null,null,79422088,"MORALES","LIZARAZO","CÉSAR","AURELIO","Dirección Administrativa","- Grupo de Trabajo de Gestión Documental y Recursos Físicos","Dirección Administrativa - Grupo de Trabajo de Gestión Documental y Recursos Físicos","Auxiliar Administrativo (Prov)","ASISTENCIAL",4044,"09"]
[88,null,null,null,null,null,null,null,null,null,null,null,null,null,null,"2016-12-03",null,null,null,null,null,null,330,null,null,null,34.899999999999899,"NO SATISFACTORIO",null,null,null,null,null,null,null,null,null,null,null,null,null,null,null,null,null,null,null,null,null,null,null,null,79948859,"MORALES","NOGUERA","DAVID","FELIPE","Dirección de Investigaciones de Protección de Usuarios de Servicios de Comunicaciones","- Grupo de Trabajo de Investigaciones Administrativas de Protección de Usuarios de Servicios de Comunicaciones","Dirección de Investigaciones de Protección de Usuarios de Servicios de Comunicaciones - Grupo de Trabajo de Investigaciones Administrativas de Protección de Usuarios de Servicios de Comunicaciones","Profesional Universitario (Prov)","PROFESIONAL",2044,10]
[89,null,null,null,null,null,null,null,null,null,null,null,null,null,null,"2016-12-04",null,null,null,null,null,null,331,null,null,null,34.999999999999901,"NO SATISFACTORIO",null,null,null,null,null,null,null,null,null,null,null,null,null,null,null,null,null,null,null,null,null,null,null,null,52124899,"MORALES","QUICENO","CEIRA"," -","Oficina de Servicios al Consumidor y de Apoyo Empresarial","- Grupo de Trabajo de Atención al Ciudadano","Oficina de Servicios al Consumidor y de Apoyo Empresarial - Grupo de Trabajo de Atención al Ciudadano","Profesional Especializado (Prov)","PROFESIONAL",2028,13]
[90,null,null,null,null,null,null,null,null,null,null,null,null,null,null,"2016-12-05",null,null,null,null,null,null,332,null,null,null,35.099999999999902,"NO SATISFACTORIO",null,null,null,null,null,null,null,null,null,null,null,null,null,null,null,null,null,null,null,null,null,null,null,null,51713950,"MORALES","ROA","EMMA","RUTH BIBIANA","Dirección Administrativa","- Grupo de Trabajo de Contratación","Dirección Administrativa - Grupo de Trabajo de Contratación","Profesional Especializado(E)","PROFESIONAL",2028,17]
[91,null,null,null,null,null,null,null,null,null,null,null,null,null,null,"2016-12-06",null,null,null,null,null,null,333,null,null,null,35.199999999999903,"NO SATISFACTORIO",null,null,null,null,null,null,null,null,null,null,null,null,null,null,null,null,null,null,null,null,null,null,null,null,33157397,"MORDECAY","DUNOYER","LYNA","DEL CARMEN","Dirección de Nuevas Creaciones","- Grupo de Trabajo de Ciencias Químicas","Dirección de Nuevas Creaciones - Grupo de Trabajo de Ciencias Químicas","Profesional Universitario (Prov)","PROFESIONAL",2044,"09"]
[92,null,null,null,null,null,null,null,null,null,null,null,null,null,null,"2016-12-07",null,null,null,null,null,null,334,null,null,null,35.299999999999898,"NO SATISFACTORIO",null,null,null,null,null,null,null,null,null,null,null,null,null,null,null,null,null,null,null,null,null,null,null,null,51636190,"MORENO","RINCÓN","HILDA"," -","Dirección Administrativa","- Grupo de Trabajo de Gestión Documental y Recursos Físicos","Dirección Administrativa - Grupo de Trabajo de Gestión Documental y Recursos Físicos","Auxiliar de Servicios Generales","ASISTENCIAL",4064,"05"]
[93,null,null,null,null,null,null,null,null,null,null,null,null,null,null,"2016-12-08",null,null,null,null,null,null,335,null,null,null,35.399999999999899,"NO SATISFACTORIO",null,null,null,null,null,null,null,null,null,null,null,null,null,null,null,null,null,null,null,null,null,null,null,null,1019085134,"MORENO","SAENZ","SANDRA","MILENA","Dirección Administrativa","- Grupo de Trabajo de Gestión Documental y Recursos Físicos","Dirección Administrativa - Grupo de Trabajo de Gestión Documental y Recursos Físicos","Auxiliar Administrativo (Prov)","ASISTENCIAL",4044,"08"]
[94,null,null,null,null,null,null,null,null,null,null,null,null,null,null,"2016-12-09",null,null,null,null,null,null,336,null,null,null,35.499999999999901,"NO SATISFACTORIO",null,null,null,null,null,null,null,null,null,null,null,null,null,null,null,null,null,null,null,null,null,null,null,null,79515637,"MOYA","MORENO","JULIO","ANDRÉS","Despacho del Superintendente Delegado para la Propiedad Industrial","- Grupo de Trabajo de Centro de Información Tecnológica y Apoyo a la Gestión de la Propiedad Industrial","Despacho del Superintendente Delegado para la Propiedad Industrial - Grupo de Trabajo de Centro de Información Tecnológica y Apoyo a la Gestión de la Propiedad Industrial","Profesional Universitario (E)","PROFESIONAL",2044,11]
[95,null,null,null,null,null,null,null,null,null,null,null,null,null,null,"2016-12-10",null,null,null,null,null,null,337,null,null,null,35.599999999999902,"NO SATISFACTORIO",null,null,null,null,null,null,null,null,null,null,null,null,null,null,null,null,null,null,null,null,null,null,null,null,39689462,"MUÑOZ","GÓMEZ","GLORIA","ELIZABETH","Dirección de Signos Distintivos","- Grupo de Trabajo de Registro","Dirección de Signos Distintivos - Grupo de Trabajo de Registro","Técnico Administrativo (Prov)","TECNICO",3124,11]
[96,null,null,null,null,null,null,null,null,null,null,null,null,null,null,"2016-12-11",null,null,null,null,null,null,338,null,null,null,35.699999999999903,"NO SATISFACTORIO",null,null,null,null,null,null,null,null,null,null,null,null,null,null,null,null,null,null,null,null,null,null,null,null,40027617,"MUÑOZ","PÉREZ","JULIETT","PATRICIA","Oficina Asesora Jurídica","- Grupo de Trabajo de Regulación","Oficina Asesora Jurídica - Grupo de Trabajo de Regulación","Profesional Especializado (E)","PROFESIONAL",2028,13]
[97,null,null,null,null,null,null,null,null,null,null,null,null,null,null,"2016-12-12",null,null,null,null,null,null,339,null,null,null,35.799999999999898,"NO SATISFACTORIO",null,null,null,null,null,null,null,null,null,null,null,null,null,null,null,null,null,null,null,null,null,null,null,null,1015431391,"MUÑOZ","ROBERTO","MANUEL","ANDRÉS","Oficina de Servicios al Consumidor y de Apoyo Empresarial","- Grupo de Trabajo Aula de Propiedad Industrial","Oficina de Servicios al Consumidor y de Apoyo Empresarial - Grupo de Trabajo Aula de Propiedad Industrial","Profesional Universitario (Prov)","PROFESIONAL",2044,"01"]
[98,null,null,null,null,null,null,null,null,null,null,null,null,null,null,"2016-12-13",null,null,null,null,null,null,340,null,null,null,35.899999999999899,"NO SATISFACTORIO",null,null,null,null,null,null,null,null,null,null,null,null,null,null,null,null,null,null,null,null,null,null,null,null,1014199913,"MUÑOZ","SÁNCHEZ","DAVID","MAURICIO","Dirección de Investigación de Protección de Datos Personales","- Grupo de Trabajo de Investigaciones Administrativas de Protección de Datos Personales","Dirección de Investigación de Protección de Datos Personales - Grupo de Trabajo de Investigaciones Administrativas de Protección de Datos Personales","Técnico Administrativo (Prov)","TECNICO",3124,11]
[99,null,null,null,null,null,null,null,null,null,null,null,null,null,null,"2016-12-14",null,null,null,null,null,null,341,null,null,null,35.999999999999901,"NO SATISFACTORIO",null,null,null,null,null,null,null,null,null,null,null,null,null,null,null,null,null,null,null,null,null,null,null,null,34569366,"MUÑOZ","TERREROS","HERLY","PATRICIA","Oficina de Servicios al Consumidor y de Apoyo Empresarial","- Grupo de Trabajo de Atención al Ciudadano","Oficina de Servicios al Consumidor y de Apoyo Empresarial - Grupo de Trabajo de Atención al Ciudadano","Profesional Universitario (Prov)","PROFESIONAL",2044,"01"]
[100,null,null,null,null,null,null,null,null,null,null,null,null,null,null,"2016-12-15",null,null,null,null,null,null,342,null,null,null,36.099999999999902,"NO SATISFACTORIO",null,null,null,null,null,null,null,null,null,null,null,null,null,null,null,null,null,null,null,null,null,null,null,null,1070953580,"MURILLO","RUBIANO","LAURA","ESTEFANI","Dirección de Investigaciones para el Control y Verificación de Reglamentos Técnicos y Metrología Legal","- Grupo de Trabajo de Investigaciones Administrativas y Apoyo Jurídico","Dirección de Investigaciones para el Control y Verificación de Reglamentos Técnicos y Metrología Legal - Grupo de Trabajo de Investigaciones Administrativas y Apoyo Jurídico","Auxiliar Administrativo (Prov)","ASISTENCIAL",4044,11]
[101,null,null,null,null,null,null,null,null,null,null,null,null,null,null,"2016-12-16",null,null,null,null,null,null,343,null,null,null,36.199999999999903,"NO SATISFACTORIO",null,null,null,null,null,null,null,null,null,null,null,null,null,null,null,null,null,null,null,null,null,null,null,null,51685498,"NAVARRO","ARIZA","MYRIAM","AMPARO","Despacho del Superintendente Delegado para el Control y Verificación de Reglamentos Técnicos y Metrología Legal","","Despacho del Superintendente Delegado para el Control y Verificación de Reglamentos Técnicos y Metrología Legal ","Secretario Ejecutivo (E)","ASISTENCIAL",4210,18]
[102,null,null,null,null,null,null,null,null,null,null,null,null,null,null,"2016-12-17",null,null,null,null,null,null,344,null,null,null,36.299999999999898,"NO SATISFACTORIO",null,null,null,null,null,null,null,null,null,null,null,null,null,null,null,null,null,null,null,null,null,null,null,null,79920222,"NAVARRO","MORALES","EDUAR","ENRIQUE","Oficina de Tecnología e Informática","- Grupo de Trabajo de Gestión de Información y Proyectos Informáticos","Oficina de Tecnología e Informática - Grupo de Trabajo de Gestión de Información y Proyectos Informáticos","Técnico Administrativo (Prov)","TECNICO",3124,11]
[103,null,null,null,null,null,null,null,null,null,null,null,null,null,null,"2016-12-18",null,null,null,null,null,null,345,null,null,null,36.399999999999899,"NO SATISFACTORIO",null,null,null,null,null,null,null,null,null,null,null,null,null,null,null,null,null,null,null,null,null,null,null,null,52523721,"NEIVA","CORTÉS","CLAUDIA","MARLÉN","Oficina de Tecnología e Informática","- Grupo de Trabajo de Infraestructura Tecnológica y Seguridad","Oficina de Tecnología e Informática - Grupo de Trabajo de Infraestructura Tecnológica y Seguridad","Técnico Administrativo (Prov)","TECNICO",3124,11]
[104,null,null,null,null,null,null,null,null,null,null,null,null,null,null,"2016-12-19",null,null,null,null,null,null,346,null,null,null,36.499999999999901,"NO SATISFACTORIO",null,null,null,null,null,null,null,null,null,null,null,null,null,null,null,null,null,null,null,null,null,null,null,null,55312683,"NIETO","PORTO","CECILIA","ISABEL","Despacho del Superintendente Delegado para la Propiedad Industrial","","Despacho del Superintendente Delegado para la Propiedad Industrial ","Asesor","ASESOR",1020,"05"]
[105,null,null,null,null,null,null,null,null,null,null,null,null,null,null,"2016-12-20",null,null,null,null,null,null,347,null,null,null,36.599999999999902,"NO SATISFACTORIO",null,null,null,null,null,null,null,null,null,null,null,null,null,null,null,null,null,null,null,null,null,null,null,null,51989460,"NIETO","ZORRO","MARTHA","HELENA","Dirección Financiera",null,"Dirección Financiera ","Profesional Especializado (E)","PROFESIONAL",2028,13]
[106,null,null,null,null,null,null,null,null,null,null,null,null,null,null,"2016-12-21",null,null,null,null,null,null,348,null,null,null,36.699999999999903,"NO SATISFACTORIO",null,null,null,null,null,null,null,null,null,null,null,null,null,null,null,null,null,null,null,null,null,null,null,null,1032405540,"NIÑO","BUSTOS","PAOLA","YIRA XIMENA","Despacho del Superintendente Delegado para Asuntos Jurisdiccionales","- Grupo de Trabajo de Defensa del Consumidor","Despacho del Superintendente Delegado para Asuntos Jurisdiccionales - Grupo de Trabajo de Defensa del Consumidor","Profesional Universitario (Prov)","PROFESIONAL",2044,"01"]
[107,null,null,null,null,null,null,null,null,null,null,null,null,null,null,"2016-12-22",null,null,null,null,null,null,349,null,null,null,36.799999999999898,"NO SATISFACTORIO",null,null,null,null,null,null,null,null,null,null,null,null,null,null,null,null,null,null,null,null,null,null,null,null,79386272,"NIÑO","ROA","PEDRO","ALEJANDRO","Despacho del Superintendente Delegado para Asuntos Jurisdiccionales","- Grupo de Trabajo de Secretaría","Despacho del Superintendente Delegado para Asuntos Jurisdiccionales - Grupo de Trabajo de Secretaría","Técnico Administrativo (E)","TECNICO",3124,15]
[108,null,null,null,null,null,null,null,null,null,null,null,null,null,null,"2016-12-23",null,null,null,null,null,null,350,null,null,null,36.899999999999899,"NO SATISFACTORIO",null,null,null,null,null,null,null,null,null,null,null,null,null,null,null,null,null,null,null,null,null,null,null,null,51584336,"NORIEGA","MURCIA","OLGA","MARLENY","Dirección de Signos Distintivos","- Grupo de Trabajo de Forma","Dirección de Signos Distintivos - Grupo de Trabajo de Forma","Profesional Universitario (Prov)","PROFESIONAL",2044,"09"]
[109,null,null,null,null,null,null,null,null,null,null,null,null,null,null,"2016-12-24",null,null,null,null,null,null,351,null,null,null,36.999999999999901,"NO SATISFACTORIO",null,null,null,null,null,null,null,null,null,null,null,null,null,null,null,null,null,null,null,null,null,null,null,null,79593133,"NÚÑEZ","BOHORQUEZ","EDGAR","EDUARDO","Dirección Financiera",null,"Dirección Financiera ","Técnico Administrativo (Prov)","TECNICO",3124,"07"]
[110,null,null,null,null,null,null,null,null,null,null,null,null,null,null,"2016-12-25",null,null,null,null,null,null,352,null,null,null,37.099999999999902,"NO SATISFACTORIO",null,null,null,null,null,null,null,null,null,null,null,null,null,null,null,null,null,null,null,null,null,null,null,null,1010191009,"ÑAÑEZ","GASCA","OBDULIA","ELIANA","Despacho del Superintendente Delegado para Asuntos Jurisdiccionales","- Grupo de Trabajo de Defensa del Consumidor","Despacho del Superintendente Delegado para Asuntos Jurisdiccionales - Grupo de Trabajo de Defensa del Consumidor","Profesional Universitario (Prov)","PROFESIONAL",2044,"01"]
[111,null,null,null,null,null,null,null,null,null,null,null,null,null,null,"2016-12-26",null,null,null,null,null,null,353,null,null,null,37.199999999999903,"NO SATISFACTORIO",null,null,null,null,null,null,null,null,null,null,null,null,null,null,null,null,null,null,null,null,null,null,null,null,51777873,"OLARTE","CASALLAS","ELVIA","SOLEDAD","Despacho del Superintendente","","Despacho del Superintendente ","Técnico Administrativo ","TECNICO",3124,11]
[112,null,null,null,null,null,null,null,null,null,null,null,null,null,null,"2016-12-27",null,null,null,null,null,null,354,null,null,null,37.299999999999898,"NO SATISFACTORIO",null,null,null,null,null,null,null,null,null,null,null,null,null,null,null,null,null,null,null,null,null,null,null,null,80233795,"OLARTE","COLLAZOS","JORGE","MARIO","Despacho del Superintendente Delegado para la Protección de la Competencia",null,"Despacho del Superintendente Delegado para la Protección de la Competencia ","Profesional Especializado (Prov)","PROFESIONAL",2028,17]
[113,null,null,null,null,null,null,null,null,null,null,null,null,null,null,"2016-12-28",null,null,null,null,null,null,355,null,null,null,37.399999999999899,"NO SATISFACTORIO",null,null,null,null,null,null,null,null,null,null,null,null,null,null,null,null,null,null,null,null,null,null,null,null,1052378411,"OLIVEROS","GONZÁLEZ","MARÍA","MARGARITA","Secretaría General","- Grupo de  Control Disciplinario Interno","Secretaría General - Grupo de  Control Disciplinario Interno","Profesional Universitario (Prov)","PROFESIONAL",2044,"03"]
[114,null,null,null,null,null,null,null,null,null,null,null,null,null,null,"2016-12-29",null,null,null,null,null,null,356,null,null,null,37.499999999999901,"NO SATISFACTORIO",null,null,null,null,null,null,null,null,null,null,null,null,null,null,null,null,null,null,null,null,null,null,null,null,51915108,"OÑATE","FLÓREZ","MYRIAM","CONSUELO","Secretaría General","- Grupo de Trabajo de Talento Humano","Secretaría General - Grupo de Trabajo de Talento Humano","Técnico Administrativo (E)","TECNICO",3124,15]
[115,null,null,null,null,null,null,null,null,null,null,null,null,null,null,"2016-12-30",null,null,null,null,null,null,357,null,null,null,37.599999999999902,"NO SATISFACTORIO",null,null,null,null,null,null,null,null,null,null,null,null,null,null,null,null,null,null,null,null,null,null,null,null,19460791,"ORJUELA","ROZO","FERNANDO"," -","Despacho del Superintendente Delegado para la Propiedad Industrial","- Grupo de Trabajo de Centro de Información Tecnológica y Apoyo a la Gestión de la Propiedad Industrial","Despacho del Superintendente Delegado para la Propiedad Industrial - Grupo de Trabajo de Centro de Información Tecnológica y Apoyo a la Gestión de la Propiedad Industrial","Profesional Especializado (E)","PROFESIONAL",2028,13]
[116,null,null,null,null,null,null,null,null,null,null,null,null,null,null,"2016-12-31",null,null,null,null,null,null,358,null,null,null,37.699999999999903,"NO SATISFACTORIO",null,null,null,null,null,null,null,null,null,null,null,null,null,null,null,null,null,null,null,null,null,null,null,null,79931127,"OROZCO","CAICEDO","EDGAR","DANIEL","Despacho del Superintendente",null,"Despacho del Superintendente ","Asesor","ASESOR",1020,"09"]
[117,null,null,null,null,null,null,null,null,null,null,null,null,null,null,"2017-01-01",null,null,null,null,null,null,359,null,null,null,37.799999999999898,"NO SATISFACTORIO",null,null,null,null,null,null,null,null,null,null,null,null,null,null,null,null,null,null,null,null,null,null,null,null,10529809,"OROZCO","MUÑOZ","WERNER","LEON","Despacho del Superintendente","- Grupo de Trabajo de Gestión Documental y Recursos Físicos","Despacho del Superintendente - Grupo de Trabajo de Gestión Documental y Recursos Físicos","Profesional Especializado ","PROFESIONAL",2028,17]
[118,null,null,null,null,null,null,null,null,null,null,null,null,null,null,"2017-01-02",null,null,null,null,null,null,360,null,null,null,37.899999999999899,"NO SATISFACTORIO",null,null,null,null,null,null,null,null,null,null,null,null,null,null,null,null,null,null,null,null,null,null,null,null,39787581,"ORTEGA","FERNÁNDEZ","MARIA","JOSÉ","Secretaría General",null,"Secretaría General ","Profesional Universitario (Prov)","PROFESIONAL",2044,11]
[119,null,null,null,null,null,null,null,null,null,null,null,null,null,null,"2017-01-03",null,null,null,null,null,null,null,null,null,null,37.999999999999901,"NO SATISFACTORIO",null,null,null,null,null,null,null,null,null,null,null,null,null,null,null,null,null,null,null,null,null,null,null,null,1032414322,"ORTÍZ","CASTAÑEDA","GLORIA","ISABEL","Dirección de Investigaciones de Protección al Consumidor","- Grupo de Trabajo de Supervisión Empresarial y Seguridad de Producto","Dirección de Investigaciones de Protección al Consumidor - Grupo de Trabajo de Supervisión Empresarial y Seguridad de Producto","Profesional Universitario (Prov)","PROFESIONAL",2044,"07"]
[120,null,null,null,null,null,null,null,null,null,null,null,null,null,null,"2017-01-04",null,null,null,null,null,null,null,null,null,null,38.099999999999902,"NO SATISFACTORIO",null,null,null,null,null,null,null,null,null,null,null,null,null,null,null,null,null,null,null,null,null,null,null,null,80089132,"ORTIZ","MENDIETA","LEONARDO"," -","Dirección Administrativa",null,"Dirección Administrativa ","Director de Superintendencia","DIRECTIVO","0105",11]
[121,null,null,null,null,null,null,null,null,null,null,null,null,null,null,"2017-01-05",null,null,null,null,null,null,null,null,null,null,38.199999999999903,"NO SATISFACTORIO",null,null,null,null,null,null,null,null,null,null,null,null,null,null,null,null,null,null,null,null,null,null,null,null,10276885,"OSORIO","ARIAS","JHON","JAIRO","Dirección de Signos Distintivos","- Grupo de Trabajo de Oposiciones y Cancelaciones","Dirección de Signos Distintivos - Grupo de Trabajo de Oposiciones y Cancelaciones","Profesional Universitario (Prov)","PROFESIONAL",2044,"07"]
[122,null,null,null,null,null,null,null,null,null,null,null,null,null,null,"2017-01-06",null,null,null,null,null,null,null,null,null,null,38.299999999999898,"NO SATISFACTORIO",null,null,null,null,null,null,null,null,null,null,null,null,null,null,null,null,null,null,null,null,null,null,null,null,52833488,"OSORIO","BETANCOURT","ANDRI","MARCELI","Secretaría General","- Grupo de Trabajo de Talento Humano","Secretaría General - Grupo de Trabajo de Talento Humano","Profesional Universitario (Prov)","PROFESIONAL",2044,10]
[123,null,null,null,null,null,null,null,null,null,null,null,null,null,null,"2017-01-07",null,null,null,null,null,null,null,null,null,null,38.399999999999899,"NO SATISFACTORIO",null,null,null,null,null,null,null,null,null,null,null,null,null,null,null,null,null,null,null,null,null,null,null,null,65778114,"OSORIO","GÓMEZ","CLAUDIA","ALEXANDRA","Oficina Asesora Jurídica","- Grupo de Trabajo de Gestión Judicial","Oficina Asesora Jurídica - Grupo de Trabajo de Gestión Judicial","Profesional Universitario (Prov)","PROFESIONAL",2044,11]
[124,null,null,null,null,null,null,null,null,null,null,null,null,null,null,"2017-01-08",null,null,null,null,null,null,null,null,null,null,38.499999999999901,"NO SATISFACTORIO",null,null,null,null,null,null,null,null,null,null,null,null,null,null,null,null,null,null,null,null,null,null,null,null,66717201,"OSPINA","QUINTERO","NORA","ALEJANDRA","Dirección Financiera",null,"Dirección Financiera ","Profesional Especializado (E)","PROFESIONAL",2028,13]
[125,null,null,null,null,null,null,null,null,null,null,null,null,null,null,"2017-01-09",null,null,null,null,null,null,null,null,null,null,38.599999999999902,"NO SATISFACTORIO",null,null,null,null,null,null,null,null,null,null,null,null,null,null,null,null,null,null,null,null,null,null,null,null,52745325,"OTERO","VILLA","JENNIFER","MARIET","Oficina Asesora de Planeación","","Oficina Asesora de Planeación ","Profesional Universitario (Prov)","PROFESIONAL",2044,"05"]
[126,null,null,null,null,null,null,null,null,null,null,null,null,null,null,"2017-01-10",null,null,null,null,null,null,null,null,null,null,38.699999999999903,"NO SATISFACTORIO",null,null,null,null,null,null,null,null,null,null,null,null,null,null,null,null,null,null,null,null,null,null,null,null,53119164,"PACHECO","RAMÍREZ ","LIZZ","DAHIAM","Despacho del Superintendente Delegado para Asuntos Jurisdiccionales","- Grupo de Trabajo de Defensa del Consumidor","Despacho del Superintendente Delegado para Asuntos Jurisdiccionales - Grupo de Trabajo de Defensa del Consumidor","Profesional Universitario (Prov)","PROFESIONAL",2044,11]
[127,null,null,null,null,null,null,null,null,null,null,null,null,null,null,"2017-01-11",null,null,null,null,null,null,null,null,null,null,38.799999999999898,"NO SATISFACTORIO",null,null,null,null,null,null,null,null,null,null,null,null,null,null,null,null,null,null,null,null,null,null,null,null,52358634,"PACHÓN","ARIZA","MAGDA","ROCÍO","Oficina de Servicios al Consumidor y de Apoyo Empresarial","- Grupo de Trabajo de Formación","Oficina de Servicios al Consumidor y de Apoyo Empresarial - Grupo de Trabajo de Formación","Profesional Universitario (E)","PROFESIONAL",2044,"07"]
[128,null,null,null,null,null,null,null,null,null,null,null,null,null,null,"2017-01-12",null,null,null,null,null,null,null,null,null,null,38.899999999999899,"NO SATISFACTORIO",null,null,null,null,null,null,null,null,null,null,null,null,null,null,null,null,null,null,null,null,null,null,null,null,24713920,"PANIAGUA","HENAO","MARTHA","TATIANA","Dirección de Investigaciones de Protección al Consumidor","","Dirección de Investigaciones de Protección al Consumidor ","Profesional Universitario (Prov)","PROFESIONAL",2044,10]
[129,null,null,null,null,null,null,null,null,null,null,null,null,null,null,"2017-01-13",null,null,null,null,null,null,null,null,null,null,38.999999999999901,"NO SATISFACTORIO",null,null,null,null,null,null,null,null,null,null,null,null,null,null,null,null,null,null,null,null,null,null,null,null,80833356,"PANQUEBA","CELY","WILSON","ALEXANDER","Oficina de Servicios al Consumidor y de Apoyo Empresarial","- Grupo de Trabajo de Atención al Ciudadano","Oficina de Servicios al Consumidor y de Apoyo Empresarial - Grupo de Trabajo de Atención al Ciudadano","Profesional Universitario (Prov)","PROFESIONAL",2044,"01"]
[130,null,null,null,null,null,null,null,null,null,null,null,null,null,null,"2017-01-14",null,null,null,null,null,null,null,null,null,null,39.099999999999902,"NO SATISFACTORIO",null,null,null,null,null,null,null,null,null,null,null,null,null,null,null,null,null,null,null,null,null,null,null,null,1018446638,"PARADA","PEÑA","FERLYN","LIZETH","Despacho del Superintendente Delegado para la Protección de la Competencia","- Grupo de Trabajo de Protección y Promoción de la Competencia","Despacho del Superintendente Delegado para la Protección de la Competencia - Grupo de Trabajo de Protección y Promoción de la Competencia","Profesional Universitario (Prov)","PROFESIONAL",2044,"01"]
[131,null,null,null,null,null,null,null,null,null,null,null,null,null,null,"2017-01-15",null,null,null,null,null,null,null,null,null,null,39.199999999999903,"NO SATISFACTORIO",null,null,null,null,null,null,null,null,null,null,null,null,null,null,null,null,null,null,null,null,null,null,null,null,38568343,"PARRA","BURBANO","MARÍA","CAROLINA","Dirección de Investigación de Protección de Datos Personales","- Grupo de Trabajo de Investigaciones Administrativas de Protección de Datos Personales","Dirección de Investigación de Protección de Datos Personales - Grupo de Trabajo de Investigaciones Administrativas de Protección de Datos Personales","Profesional Universitario (Prov)","PROFESIONAL",2044,"07"]
[132,null,null,null,null,null,null,null,null,null,null,null,null,null,null,"2017-01-16",null,null,null,null,null,null,null,null,null,null,39.299999999999898,"NO SATISFACTORIO",null,null,null,null,null,null,null,null,null,null,null,null,null,null,null,null,null,null,null,null,null,null,null,null,79128667,"PARRA","MANCERA","OROSMAN","ANTONIO","Oficina de Tecnología e Informática","- Grupo de Trabajo de Sistemas de Información","Oficina de Tecnología e Informática - Grupo de Trabajo de Sistemas de Información","Profesional Especializado (E)","PROFESIONAL",2028,13]
[133,null,null,null,null,null,null,null,null,null,null,null,null,null,null,"2017-01-17",null,null,null,null,null,null,null,null,null,null,39.399999999999899,"NO SATISFACTORIO",null,null,null,null,null,null,null,null,null,null,null,null,null,null,null,null,null,null,null,null,null,null,null,null,52698778,"PARRA","TORRADO","AIDA","LORENA","Dirección de Investigaciones para el Control y Verificación de Reglamentos Técnicos y Metrología Legal","- Grupo de Trabajo de Investigaciones Administrativas y Apoyo Jurídico","Dirección de Investigaciones para el Control y Verificación de Reglamentos Técnicos y Metrología Legal - Grupo de Trabajo de Investigaciones Administrativas y Apoyo Jurídico","Profesional Universitario (Prov)","PROFESIONAL",2044,11]
[134,null,null,null,null,null,null,null,null,null,null,null,null,null,null,"2017-01-18",null,null,null,null,null,null,null,null,null,null,39.499999999999901,"NO SATISFACTORIO",null,null,null,null,null,null,null,null,null,null,null,null,null,null,null,null,null,null,null,null,null,null,null,null,51985014,"PARRADO","MERCHÁN","MÓNICA"," -","Despacho del Superintendente Delegado para Asuntos Jurisdiccionales","- Grupo de Trabajo para la Verificación del Cumplimiento","Despacho del Superintendente Delegado para Asuntos Jurisdiccionales - Grupo de Trabajo para la Verificación del Cumplimiento","Profesional Universitario (Prov)","PROFESIONAL",2044,10]
[135,null,null,null,null,null,null,null,null,null,null,null,null,null,null,"2017-01-19",null,null,null,null,null,null,null,null,null,null,39.599999999999902,"NO SATISFACTORIO",null,null,null,null,null,null,null,null,null,null,null,null,null,null,null,null,null,null,null,null,null,null,null,null,51846017,"PARRISH","CHACON","CIELO","CAROLINA","Dirección Administrativa","- Grupo de Trabajo de Gestión Documental y Recursos Físicos",{"$f":"CONCATENATE(BF387,\" \",BG387)","v":"Dirección Administrativa - Grupo de Trabajo de Gestión Documental y Recursos Físicos"},"Auxiliar Administrativo (Prov)","ASISTENCIAL",4044,"07"]
[136,null,null,null,null,null,null,null,null,null,null,null,null,null,null,"2017-01-20",null,null,null,null,null,null,null,null,null,null,39.699999999999903,"NO SATISFACTORIO",null,null,null,null,null,null,null,null,null,null,null,null,null,null,null,null,null,null,null,null,null,null,null,null,64550821,"PATERNINA","MÁRQUEZ","ASTRID"," -","Oficina Asesora Jurídica","- Grupo de Trabajo de Gestión Judicial","Oficina Asesora Jurídica - Grupo de Trabajo de Gestión Judicial","Profesional Universitario (Prov)","PROFESIONAL",2044,"07"]
[137,null,null,null,null,null,null,null,null,null,null,null,null,null,null,"2017-01-21",null,null,null,null,null,null,null,null,null,null,39.799999999999898,"NO SATISFACTORIO",null,null,null,null,null,null,null,null,null,null,null,null,null,null,null,null,null,null,null,null,null,null,null,null,51894169,"PEDRAZA","RODRÍGUEZ","AMANDA","ESTELLA","Oficina Asesora de Planeación","","Oficina Asesora de Planeación ","Profesional Universitario (E)","PROFESIONAL",2044,11]
[138,null,null,null,null,null,null,null,null,null,null,null,null,null,null,"2017-01-22",null,null,null,null,null,null,null,null,null,null,39.899999999999899,"NO SATISFACTORIO",null,null,null,null,null,null,null,null,null,null,null,null,null,null,null,null,null,null,null,null,null,null,null,null,53117620,"PEÑA","GAITÁN","LEYDI","NAYIVI","Dirección de Investigaciones de Protección de Usuarios de Servicios de Comunicaciones","- Grupo de Trabajo de Supervisión, Control y Vigilancia de los Regímenes de Protección de Usuarios de Servicios de Comunicaciones","Dirección de Investigaciones de Protección de Usuarios de Servicios de Comunicaciones - Grupo de Trabajo de Supervisión, Control y Vigilancia de los Regímenes de Protección de Usuarios de Servicios de Comunicaciones","Profesional Universitario (Prov)","PROFESIONAL",2044,"09"]
[139,null,null,null,null,null,null,null,null,null,null,null,null,null,null,"2017-01-23",null,null,null,null,null,null,null,null,null,null,39.999999999999901,"NO SATISFACTORIO",null,null,null,null,null,null,null,null,null,null,null,null,null,null,null,null,null,null,null,null,null,null,null,null,52980102,"PEÑA","GÓMEZ","YADID","ANDREA","Dirección de Investigaciones de Protección al Consumidor","- Grupo de Trabajo de Supervisión Empresarial y Seguridad de Producto","Dirección de Investigaciones de Protección al Consumidor - Grupo de Trabajo de Supervisión Empresarial y Seguridad de Producto","Profesional Universitario (Prov)","PROFESIONAL",2044,"07"]
[140,null,null,null,null,null,null,null,null,null,null,null,null,null,null,"2017-01-24",null,null,null,null,null,null,null,null,null,null,40.099999999999902,"NO SATISFACTORIO",null,null,null,null,null,null,null,null,null,null,null,null,null,null,null,null,null,null,null,null,null,null,null,null,79464486,"PEÑA","GONZALEZ","PABLO","ENRIQUE","Dirección Administrativa","- Grupo de Trabajo de Gestión Documental y Recursos Físicos","Dirección Administrativa - Grupo de Trabajo de Gestión Documental y Recursos Físicos","Técnico Administrativo (E)","TECNICO",3124,11]
[141,null,null,null,null,null,null,null,null,null,null,null,null,null,null,"2017-01-25",null,null,null,null,null,null,null,null,null,null,40.199999999999903,"NO SATISFACTORIO",null,null,null,null,null,null,null,null,null,null,null,null,null,null,null,null,null,null,null,null,null,null,null,null,79634793,"PEÑA","PORRAS","JOHN","JAIRO","Dirección de Signos Distintivos",null,"Dirección de Signos Distintivos ","Técnico Administrativo (Prov)","TECNICO",3124,11]
[142,null,null,null,null,null,null,null,null,null,null,null,null,null,null,"2017-01-26",null,null,null,null,null,null,null,null,null,null,40.299999999999898,"NO SATISFACTORIO",null,null,null,null,null,null,null,null,null,null,null,null,null,null,null,null,null,null,null,null,null,null,null,null,11429040,"PEÑA","TORRES","MIGUEL","ORLANDO","Despacho del Superintendente Delegado para la Protección de la Competencia","- Grupo de Trabajo de Prácticas Restrictivas de la Competencia","Despacho del Superintendente Delegado para la Protección de la Competencia - Grupo de Trabajo de Prácticas Restrictivas de la Competencia","Profesional Especializado (E)","PROFESIONAL",2028,13]
[143,null,null,null,null,null,null,null,null,null,null,null,null,null,null,"2017-01-27",null,null,null,null,null,null,null,null,null,null,40.399999999999899,"NO SATISFACTORIO",null,null,null,null,null,null,null,null,null,null,null,null,null,null,null,null,null,null,null,null,null,null,null,null,1015410702,"PEÑA","VARGAS","NATALIA","MARÍA","Secretaría General","- Grupo de Trabajo de Notificaciones y Certificaciones","Secretaría General - Grupo de Trabajo de Notificaciones y Certificaciones","Auxiliar Administrativo (Prov)","ASISTENCIAL",4044,11]
[144,null,null,null,null,null,null,null,null,null,null,null,null,null,null,"2017-01-28",null,null,null,null,null,null,null,null,null,null,40.499999999999901,"NO SATISFACTORIO",null,null,null,null,null,null,null,null,null,null,null,null,null,null,null,null,null,null,null,null,null,null,null,null,80198063,"PERDOMO","ALZATE","CARLOS","ERNESTO","Dirección Financiera",null,"Dirección Financiera ","Profesional Universitario (Prov)","PROFESIONAL",2044,"09"]
[145,null,null,null,null,null,null,null,null,null,null,null,null,null,null,"2017-01-29",null,null,null,null,null,null,null,null,null,null,40.599999999999902,"NO SATISFACTORIO",null,null,null,null,null,null,null,null,null,null,null,null,null,null,null,null,null,null,null,null,null,null,null,null,18002497,"PÉREZ","GAITÁN","ERICK","OTTOVIANNY","Oficina Asesora de Planeación",null,"Oficina Asesora de Planeación ","Profesional Universitario (Prov)","PROFESIONAL",2044,"07"]
[146,null,null,null,null,null,null,null,null,null,null,null,null,null,null,"2017-01-30",null,null,null,null,null,null,null,null,null,null,40.699999999999903,"NO SATISFACTORIO",null,null,null,null,null,null,null,null,null,null,null,null,null,null,null,null,null,null,null,null,null,null,null,null,1013583810,"PÉREZ","MALDONADO","JENNYFER","CATALINA","Oficina de Tecnología e Informática","- Grupo de Trabajo de Infraestructura Tecnológica y Seguridad","Oficina de Tecnología e Informática - Grupo de Trabajo de Infraestructura Tecnológica y Seguridad","Profesional Universitario (Prov)","PROFESIONAL",2044,"07"]
[147,null,null,null,null,null,null,null,null,null,null,null,null,null,null,"2017-01-31",null,null,null,null,null,null,null,null,null,null,40.799999999999898,"NO SATISFACTORIO",null,null,null,null,null,null,null,null,null,null,null,null,null,null,null,null,null,null,null,null,null,null,null,null,80165952,"PÉREZ","ORDUZ","JORGE","ANDRÉS","Despacho del Superintendente","","Despacho del Superintendente ","Asesor","ASESOR",1020,"09"]
[148,null,null,null,null,null,null,null,null,null,null,null,null,null,null,"2017-02-01",null,null,null,null,null,null,null,null,null,null,40.899999999999899,"NO SATISFACTORIO",null,null,null,null,null,null,null,null,null,null,null,null,null,null,null,null,null,null,null,null,null,null,null,null,1075654821,"PÉREZ","VARGAS","PEDRO"," -","Dirección de Investigaciones para el Control y Verificación de Reglamentos Técnicos y Metrología Legal","-Grupo de Trabajo de Inspección y Vigilancia de Reglamentos Técnicos","Dirección de Investigaciones para el Control y Verificación de Reglamentos Técnicos y Metrología Legal -Grupo de Trabajo de Inspección y Vigilancia de Reglamentos Técnicos","Profesional Universitario (Prov)","PROFESIONAL",2044,"07"]
[149,null,null,null,null,null,null,null,null,null,null,null,null,null,null,"2017-02-02",null,null,null,null,null,null,null,null,null,null,40.999999999999901,"NO SATISFACTORIO",null,null,null,null,null,null,null,null,null,null,null,null,null,null,null,null,null,null,null,null,null,null,null,null,1067858450,"PERIÑAN","YEPES","YINA","PAOLA","Dirección de Investigaciones de Protección al Consumidor",null,"Dirección de Investigaciones de Protección al Consumidor ","Profesional Universitario (Prov)","PROFESIONAL",2044,"07"]
[150,null,null,null,null,null,null,null,null,null,null,null,null,null,null,"2017-02-03",null,null,null,null,null,null,null,null,null,null,41.099999999999902,"NO SATISFACTORIO",null,null,null,null,null,null,null,null,null,null,null,null,null,null,null,null,null,null,null,null,null,null,null,null,1018431494,"PETRO","AGUILAR","ANA","CAROLINA","Dirección de Signos Distintivos","- Grupo de Trabajo de Forma","Dirección de Signos Distintivos - Grupo de Trabajo de Forma","Profesional Universitario (Prov)","PROFESIONAL",2044,"01"]
[151,null,null,null,null,null,null,null,null,null,null,null,null,null,null,"2017-02-04",null,null,null,null,null,null,null,null,null,null,41.199999999999903,"NO SATISFACTORIO",null,null,null,null,null,null,null,null,null,null,null,null,null,null,null,null,null,null,null,null,null,null,null,null,45476851,"PIMIENTA","CORBACHO","MARÍA","DEL SOCORRO","Despacho del Superintendente Delegado para la Protección de la Competencia",null,"Despacho del Superintendente Delegado para la Protección de la Competencia ","Profesional Especializado (E)","PROFESIONAL",2028,19]
[152,null,null,null,null,null,null,null,null,null,null,null,null,null,null,"2017-02-05",null,null,null,null,null,null,null,null,null,null,41.299999999999898,"NO SATISFACTORIO",null,null,null,null,null,null,null,null,null,null,null,null,null,null,null,null,null,null,null,null,null,null,null,null,53103404,"PINEDA","RUBIANO","MYRIAM","JANETH","Despacho del Superintendente Delegado para Asuntos Jurisdiccionales","","Despacho del Superintendente Delegado para Asuntos Jurisdiccionales ","Profesional Universitario (Prov)","PROFESIONAL",2044,"01"]
[153,null,null,null,null,null,null,null,null,null,null,null,null,null,null,"2017-02-06",null,null,null,null,null,null,null,null,null,null,41.399999999999899,"NO SATISFACTORIO",null,null,null,null,null,null,null,null,null,null,null,null,null,null,null,null,null,null,null,null,null,null,null,null,52560685,"PINILLA","ALFONSO","OLGA","LUCÍA","Dirección Administrativa","- Grupo de Trabajo de Contratación","Dirección Administrativa - Grupo de Trabajo de Contratación","Secretario (Prov)","ASISTENCIAL",4178,10]
[154,null,null,null,null,null,null,null,null,null,null,null,null,null,null,"2017-02-07",null,null,null,null,null,null,null,null,null,null,41.499999999999901,"NO SATISFACTORIO",null,null,null,null,null,null,null,null,null,null,null,null,null,null,null,null,null,null,null,null,null,null,null,null,1143425889,"POLANCO","GARCÍA","CAROLINA","PATRICIA","Despacho del Superintendente Delegado para la Protección de la Competencia","- Grupo de Trabajo de Protección y Promoción de la Competencia","Despacho del Superintendente Delegado para la Protección de la Competencia - Grupo de Trabajo de Protección y Promoción de la Competencia","Profesional Universitario (Prov)","PROFESIONAL",2044,10]
[155,null,null,null,null,null,null,null,null,null,null,null,null,null,null,"2017-02-08",null,null,null,null,null,null,null,null,null,null,41.599999999999902,"NO SATISFACTORIO",null,null,null,null,null,null,null,null,null,null,null,null,null,null,null,null,null,null,null,null,null,null,null,null,35466106,"POLO","CORDOBA","DORIS","ELENA","Oficina Asesora Jurídica","- Grupo de Trabajo de Gestión Judicial","Oficina Asesora Jurídica - Grupo de Trabajo de Gestión Judicial","Profesional Especializado (E)","PROFESIONAL",2028,13]
[156,null,null,null,null,null,null,null,null,null,null,null,null,null,null,"2017-02-09",null,null,null,null,null,null,null,null,null,null,41.699999999999903,"NO SATISFACTORIO",null,null,null,null,null,null,null,null,null,null,null,null,null,null,null,null,null,null,null,null,null,null,null,null,1048208910,"POLO","DURAN","JORGE","ELIECER","Despacho del Superintendente Delegado para Asuntos Jurisdiccionales","- Grupo de Trabajo de Defensa del Consumidor","Despacho del Superintendente Delegado para Asuntos Jurisdiccionales - Grupo de Trabajo de Defensa del Consumidor","Profesional Universitario (Prov)","PROFESIONAL",2044,"01"]
[157,null,null,null,null,null,null,null,null,null,null,null,null,null,null,"2017-02-10",null,null,null,null,null,null,null,null,null,null,41.799999999999898,"NO SATISFACTORIO",null,null,null,null,null,null,null,null,null,null,null,null,null,null,null,null,null,null,null,null,null,null,null,null,52057049,"POLO","ENRÍQUEZ","MARÍA","CLARA","Dirección de Investigaciones para el Control y Verificación de Reglamentos Técnicos y Metrología Legal","- Grupo de Trabajo de Investigaciones Administrativas y Apoyo Jurídico","Dirección de Investigaciones para el Control y Verificación de Reglamentos Técnicos y Metrología Legal - Grupo de Trabajo de Investigaciones Administrativas y Apoyo Jurídico","Profesional Especializado (Prov)","PROFESIONAL",2028,13]
[158,null,null,null,null,null,null,null,null,null,null,null,null,null,null,"2017-02-11",null,null,null,null,null,null,null,null,null,null,41.899999999999899,"NO SATISFACTORIO",null,null,null,null,null,null,null,null,null,null,null,null,null,null,null,null,null,null,null,null,null,null,null,null,79862767,"PONCE","VERJEL","RACHID"," -","Dirección de Nuevas Creaciones","- Grupo de Trabajo del Sector de Ingenierías","Dirección de Nuevas Creaciones - Grupo de Trabajo del Sector de Ingenierías","Profesional Universitario (Prov)","PROFESIONAL",2044,"05"]
[159,null,null,null,null,null,null,null,null,null,null,null,null,null,null,"2017-02-12",null,null,null,null,null,null,null,null,null,null,41.999999999999901,"NO SATISFACTORIO",null,null,null,null,null,null,null,null,null,null,null,null,null,null,null,null,null,null,null,null,null,null,null,null,52283206,"POSSE","URUEÑA","REGINA","ANDREA","Dirección Administrativa","- Grupo de Trabajo de Gestión Documental y Recursos Físicos","Dirección Administrativa - Grupo de Trabajo de Gestión Documental y Recursos Físicos","Técnico Administrativo (Prov)","TECNICO",3124,"07"]
[160,null,null,null,null,null,null,null,null,null,null,null,null,null,null,"2017-02-13",null,null,null,null,null,null,null,null,null,null,42.099999999999902,"NO SATISFACTORIO",null,null,null,null,null,null,null,null,null,null,null,null,null,null,null,null,null,null,null,null,null,null,null,null,51921004,"POVEDA","TORRES","DORA"," -","Dirección Financiera",null,"Dirección Financiera ","Secretario (Prov)","ASISTENCIAL",4178,10]
[161,null,null,null,null,null,null,null,null,null,null,null,null,null,null,"2017-02-14",null,null,null,null,null,null,null,null,null,null,42.199999999999903,"NO SATISFACTORIO",null,null,null,null,null,null,null,null,null,null,null,null,null,null,null,null,null,null,null,null,null,null,null,null,79405364,"PRIETO","AGUDELO","ALEJANDRO"," -","Dirección Administrativa","- Grupo de Trabajo de Gestión Documental y Recursos Físicos","Dirección Administrativa - Grupo de Trabajo de Gestión Documental y Recursos Físicos","Técnico Administrativo","TECNICO",3124,11]
[162,null,null,null,null,null,null,null,null,null,null,null,null,null,null,"2017-02-15",null,null,null,null,null,null,null,null,null,null,42.299999999999898,"NO SATISFACTORIO",null,null,null,null,null,null,null,null,null,null,null,null,null,null,null,null,null,null,null,null,null,null,null,null,21070588,"PRIETO","AGUILERA","BLANCA","MARÍA DEL PILAR","Dirección de Signos Distintivos","- Grupo de Trabajo de Fondo","Dirección de Signos Distintivos - Grupo de Trabajo de Fondo","Profesional Universitario (Prov)","PROFESIONAL",2044,"03"]
[163,null,null,null,null,null,null,null,null,null,null,null,null,null,null,"2017-02-16",null,null,null,null,null,null,null,null,null,null,42.399999999999899,"NO SATISFACTORIO",null,null,null,null,null,null,null,null,null,null,null,null,null,null,null,null,null,null,null,null,null,null,null,null,51832485,"PRIETO","ECHEVERRY","AURA","MARÍA","Despacho del Superintendente Delegado para la Protección del Consumidor","","Despacho del Superintendente Delegado para la Protección del Consumidor ","Profesional Especializado (E)","PROFESIONAL",2028,13]
[164,null,null,null,null,null,null,null,null,null,null,null,null,null,null,"2017-02-17",null,null,null,null,null,null,null,null,null,null,42.499999999999901,"NO SATISFACTORIO",null,null,null,null,null,null,null,null,null,null,null,null,null,null,null,null,null,null,null,null,null,null,null,null,39651221,"PRIETO","RANGEL","ANA","MARÍA","Dirección de Investigaciones para el Control y Verificación de Reglamentos Técnicos y Metrología Legal","","Dirección de Investigaciones para el Control y Verificación de Reglamentos Técnicos y Metrología Legal ","Director de Superintendencia","DIRECTIVO","0105",11]
[165,null,null,null,null,null,null,null,null,null,null,null,null,null,null,"2017-02-18",null,null,null,null,null,null,null,null,null,null,42.599999999999902,"NO SATISFACTORIO",null,null,null,null,null,null,null,null,null,null,null,null,null,null,null,null,null,null,null,null,null,null,null,null,19316758,"PRIETO","RANGEL","JULIO","CÉSAR","Despacho del Superintendente Delegado para Asuntos Jurisdiccionales","- Grupo de Trabajo de Secretaría","Despacho del Superintendente Delegado para Asuntos Jurisdiccionales - Grupo de Trabajo de Secretaría","Técnico Administrativo (Prov)","TECNICO",3124,11]
[166,null,null,null,null,null,null,null,null,null,null,null,null,null,null,"2017-02-19",null,null,null,null,null,null,null,null,null,null,42.699999999999903,"NO SATISFACTORIO",null,null,null,null,null,null,null,null,null,null,null,null,null,null,null,null,null,null,null,null,null,null,null,null,7179516,"PUENTES","SILVA","FIDEL"," -","Despacho del Superintendente Delegado para Asuntos Jurisdiccionales","","Despacho del Superintendente Delegado para Asuntos Jurisdiccionales ","Superintendente Delegado","DIRECTIVO","0110",19]
[167,null,null,null,null,null,null,null,null,null,null,null,null,null,null,"2017-02-20",null,null,null,null,null,null,null,null,null,null,42.799999999999898,"NO SATISFACTORIO",null,null,null,null,null,null,null,null,null,null,null,null,null,null,null,null,null,null,null,null,null,null,null,null,63349760,"QUINTERO","ACOSTA","YUDYSELA"," -","Secretaría General","- Grupo de Trabajo de Talento Humano","Secretaría General - Grupo de Trabajo de Talento Humano","Profesional Universitario (E)","PROFESIONAL",2044,"01"]
[168,null,null,null,null,null,null,null,null,null,null,null,null,null,null,"2017-02-21",null,null,null,null,null,null,null,null,null,null,42.899999999999899,"NO SATISFACTORIO",null,null,null,null,null,null,null,null,null,null,null,null,null,null,null,null,null,null,null,null,null,null,null,null,49782335,"QUINTERO","GRANADILLO","MAYRA","SOL","Dirección de Investigaciones de Protección de Usuarios de Servicios de Comunicaciones","- Grupo de Trabajo de Investigaciones Administrativas de Protección de Usuarios de Servicios de Comunicaciones","Dirección de Investigaciones de Protección de Usuarios de Servicios de Comunicaciones - Grupo de Trabajo de Investigaciones Administrativas de Protección de Usuarios de Servicios de Comunicaciones","Profesional Universitario (Prov)","PROFESIONAL",2044,"07"]
[169,null,null,null,null,null,null,null,null,null,null,null,null,null,null,"2017-02-22",null,null,null,null,null,null,null,null,null,null,42.999999999999901,"NO SATISFACTORIO",null,null,null,null,null,null,null,null,null,null,null,null,null,null,null,null,null,null,null,null,null,null,null,null,1026555490,"QUINTERO","VALBUENA","MAYRA","ALEJANDRA","Dirección de Nuevas Creaciones","- Grupo de Trabajo de Ciencias Químicas","Dirección de Nuevas Creaciones - Grupo de Trabajo de Ciencias Químicas","Profesional Universitario (Prov)","PROFESIONAL",2044,"05"]
[170,null,null,null,null,null,null,null,null,null,null,null,null,null,null,"2017-02-23",null,null,null,null,null,null,null,null,null,null,43.099999999999902,"NO SATISFACTORIO",null,null,null,null,null,null,null,null,null,null,null,null,null,null,null,null,null,null,null,null,null,null,null,null,35199495,"RAMIREZ","CANO","ANGELICA","MARÍA","Dirección de Nuevas Creaciones","- Grupo de Trabajo del Sector de Ingenierías","Dirección de Nuevas Creaciones - Grupo de Trabajo del Sector de Ingenierías","Profesional Universitario (Prov)","PROFESIONAL",2044,"01"]
[171,null,null,null,null,null,null,null,null,null,null,null,null,null,null,"2017-02-24",null,null,null,null,null,null,null,null,null,null,43.199999999999903,"NO SATISFACTORIO",null,null,null,null,null,null,null,null,null,null,null,null,null,null,null,null,null,null,null,null,null,null,null,null,1018404975,"RAMÍREZ","HERMIDA","NÉSTOR","MAURO","Oficina de Servicios al Consumidor y de Apoyo Empresarial","- Grupo de Trabajo de Atención al Ciudadano","Oficina de Servicios al Consumidor y de Apoyo Empresarial - Grupo de Trabajo de Atención al Ciudadano","Profesional Universitario (Prov)","PROFESIONAL",2044,"03"]
[172,null,null,null,null,null,null,null,null,null,null,null,null,null,null,"2017-02-25",null,null,null,null,null,null,null,null,null,null,43.299999999999898,"NO SATISFACTORIO",null,null,null,null,null,null,null,null,null,null,null,null,null,null,null,null,null,null,null,null,null,null,null,null,52419271,"RAMIREZ","HINESTROZA","MÓNICA","ANDREA","Despacho del Superintendente Delegado para la Protección del Consumidor","","Despacho del Superintendente Delegado para la Protección del Consumidor ","Superintendente Delegado","DIRECTIVO","0110",19]
[173,null,null,null,null,null,null,null,null,null,null,null,null,null,null,"2017-02-26",null,null,null,null,null,null,null,null,null,null,43.399999999999899,"NO SATISFACTORIO",null,null,null,null,null,null,null,null,null,null,null,null,null,null,null,null,null,null,null,null,null,null,null,null,1030525572,"RAMIREZ","REYES","DAYRON","ALEXANDER","Dirección de Nuevas Creaciones","- Grupo de Trabajo de Ciencias Farmacéuticas y Biológicas","Dirección de Nuevas Creaciones - Grupo de Trabajo de Ciencias Farmacéuticas y Biológicas","Profesional Universitario (Prov)","PROFESIONAL",2044,"05"]
[174,null,null,null,null,null,null,null,null,null,null,null,null,null,null,"2017-02-27",null,null,null,null,null,null,null,null,null,null,43.499999999999901,"NO SATISFACTORIO",null,null,null,null,null,null,null,null,null,null,null,null,null,null,null,null,null,null,null,null,null,null,null,null,1019020584,"RAMÍREZ","TORRES","OSCAR","FABIÁN","Despacho del Superintendente Delegado para la Protección de la Competencia",null,"Despacho del Superintendente Delegado para la Protección de la Competencia ","Técnico Administrativo (Prov)","TECNICO",3124,"09"]
[175,null,null,null,null,null,null,null,null,null,null,null,null,null,null,"2017-02-28",null,null,null,null,null,null,null,null,null,null,43.599999999999902,"NO SATISFACTORIO",null,null,null,null,null,null,null,null,null,null,null,null,null,null,null,null,null,null,null,null,null,null,null,null,1016042834,"RAMÍREZ","VALBUENA","YUBELLY"," -","Dirección Financiera",null,"Dirección Financiera ","Auxiliar Administrativo (Prov)","ASISTENCIAL",4044,"08"]
[176,null,null,null,null,null,null,null,null,null,null,null,null,null,null,"2017-03-01",null,null,null,null,null,null,null,null,null,null,43.699999999999903,"NO SATISFACTORIO",null,null,null,null,null,null,null,null,null,null,null,null,null,null,null,null,null,null,null,null,null,null,null,null,79803419,"RAMOS","ACOSTA","JUAN","MAURICIO","Oficina Asesora Jurídica","- Grupo de Trabajo de Cobro Coactivo","Oficina Asesora Jurídica - Grupo de Trabajo de Cobro Coactivo","Auxiliar Administrativo (Prov)","ASISTENCIAL",4044,11]
[177,null,null,null,null,null,null,null,null,null,null,null,null,null,null,"2017-03-02",null,null,null,null,null,null,null,null,null,null,43.799999999999898,"NO SATISFACTORIO",null,null,null,null,null,null,null,null,null,null,null,null,null,null,null,null,null,null,null,null,null,null,null,null,1013591757,"RAMOS","BEDOYA","JAIRO","JULIÁN","Despacho del Superintendente Delegado para el Control y Verificación de Reglamentos Técnicos y Metrología Legal",null,"Despacho del Superintendente Delegado para el Control y Verificación de Reglamentos Técnicos y Metrología Legal ","Profesional Universitario (Prov)","PROFESIONAL",2044,"07"]
[null,null,null,null,null,null,null,null,null,null,null,null,null,null,null,"2017-03-03",null,null,null,null,null,null,null,null,null,null,43.899999999999899,"NO SATISFACTORIO",null,null,null,null,null,null,null,null,null,null,null,null,null,null,null,null,null,null,null,null,null,null,null,null,1032375313,"RESTREPO","BERNAL","FABIO","ANDRÉS","Dirección de Investigaciones de Protección de Usuarios de Servicios de Comunicaciones","","Dirección de Investigaciones de Protección de Usuarios de Servicios de Comunicaciones ","Director de Superintendencia","DIRECTIVO","0105",11]
["COMPROMISO LABORAL",null,null,null,null,null,null,null,null,null,null,null,null,null,null,"2017-03-04",null,null,null,null,null,null,null,null,null,null,43.999999999999901,"NO SATISFACTORIO",null,null,null,null,null,null,null,null,null,null,null,null,null,null,null,null,null,null,null,null,null,null,null,null,52699743,"RESTREPO","GÓMEZ","DIANA","MARCELA","Despacho del Superintendente Delegado para la Protección de la Competencia","- Grupo de Trabajo de Integraciones Empresariales","Despacho del Superintendente Delegado para la Protección de la Competencia - Grupo de Trabajo de Integraciones Empresariales","Profesional Universitario (Prov)","PROFESIONAL",2044,10]
["COMPETENCIA COMPORTAMENTAL",null,null,null,null,null,null,null,null,null,null,null,null,null,null,"2017-03-05",null,null,null,null,null,null,null,null,null,null,44.099999999999902,"NO SATISFACTORIO",null,null,null,null,null,null,null,null,null,null,null,null,null,null,null,null,null,null,null,null,null,null,null,null,52869665,"RESTREPO","GÓMEZ","LILIANA"," -","Despacho del Superintendente Delegado para la Propiedad Industrial","- Grupo de Trabajo de Centro de Información Tecnológica y Apoyo a la Gestión de la Propiedad Industrial","Despacho del Superintendente Delegado para la Propiedad Industrial - Grupo de Trabajo de Centro de Información Tecnológica y Apoyo a la Gestión de la Propiedad Industrial","Profesional Universitario (Prov)","PROFESIONAL",2044,"09"]
[null,null,null,null,null,null,null,null,null,null,null,null,null,null,null,"2017-03-06",null,null,null,null,null,null,null,null,null,null,44.199999999999903,"NO SATISFACTORIO",null,null,null,null,null,null,null,null,null,null,null,null,null,null,null,null,null,null,null,null,null,null,null,null,1032425351,"RESTREPO","USECHE","DAVID","FERNANDO","Despacho del Superintendente Delegado para la Propiedad Industrial","- Grupo de Trabajo de Vía Gubernativa","Despacho del Superintendente Delegado para la Propiedad Industrial - Grupo de Trabajo de Vía Gubernativa","Profesional Universitario (Prov)","PROFESIONAL",2044,"03"]
["SEGUIMIENTO",null,null,null,null,null,null,null,null,null,null,null,null,null,null,"2017-03-07",null,null,null,null,null,null,null,null,null,null,44.299999999999898,"NO SATISFACTORIO",null,null,null,null,null,null,null,null,null,null,null,null,null,null,null,null,null,null,null,null,null,null,null,null,41759143,"RETAVISCA","RODRÍGUEZ","BLANCA","ANA","Dirección Administrativa","- Grupo de Trabajo de Gestión Documental y Recursos Físicos","Dirección Administrativa - Grupo de Trabajo de Gestión Documental y Recursos Físicos","Secretario (Prov)","ASISTENCIAL",4178,10]
["EXTRAORDINARIA",null,null,null,null,null,null,null,null,null,null,null,null,null,null,"2017-03-08",null,null,null,null,null,null,null,null,null,null,44.399999999999899,"NO SATISFACTORIO",null,null,null,null,null,null,null,null,null,null,null,null,null,null,null,null,null,null,null,null,null,null,null,null,79828521,"RICO","MEDINA","JUAN","CARLOS","Oficina de Servicios al Consumidor y de Apoyo Empresarial","- Grupo de Trabajo de Formación","Oficina de Servicios al Consumidor y de Apoyo Empresarial - Grupo de Trabajo de Formación","Profesional Universitario (Prov)","PROFESIONAL",2044,10]
["EVENTUAL",null,null,null,null,null,null,null,null,null,null,null,null,null,null,"2017-03-09",null,null,null,null,null,null,null,null,null,null,44.499999999999901,"NO SATISFACTORIO",null,null,null,null,null,null,null,null,null,null,null,null,null,null,null,null,null,null,null,null,null,null,null,null,79501143,"RIGUEROS","BELTRÁN","WILSON","ARMANDO","Oficina de Tecnología e Informática",null,"Oficina de Tecnología e Informática ","Secretario Ejecutivo (E)","ASISTENCIAL",4210,18]
["EVALUACIÓN SEMESTRAL",null,null,null,null,null,null,null,null,null,null,null,null,null,null,"2017-03-10",null,null,null,null,null,null,null,null,null,null,44.599999999999902,"NO SATISFACTORIO",null,null,null,null,null,null,null,null,null,null,null,null,null,null,null,null,null,null,null,null,null,null,null,null,51984935,"RINCKOAR","REYES","TAMARA","SIOMAR","Despacho del Superintendente Delegado para la Protección del Consumidor","","Despacho del Superintendente Delegado para la Protección del Consumidor ","Secretario (Prov)","ASISTENCIAL",4178,13]
["EVA. INF. AL SEMESTRE",null,null,null,null,null,null,null,null,null,null,null,null,null,null,"2017-03-11",null,null,null,null,null,null,null,null,null,null,44.699999999999903,"NO SATISFACTORIO",null,null,null,null,null,null,null,null,null,null,null,null,null,null,null,null,null,null,null,null,null,null,null,null,41772055,"RINCÓN","GIRALDO","MARIA","CRISTINA","Oficina Asesora Jurídica","- Grupo de Trabajo de Regulación","Oficina Asesora Jurídica - Grupo de Trabajo de Regulación","Profesional Especializado (E)","PROFESIONAL",2028,13]
["PERÍODO DE PRUEBA",null,null,null,null,null,null,null,null,null,null,null,null,null,null,"2017-03-12",null,null,null,null,null,null,null,null,null,null,44.799999999999898,"NO SATISFACTORIO",null,null,null,null,null,null,null,null,null,null,null,null,null,null,null,null,null,null,null,null,null,null,null,null,52715132,"RINCÓN","PEÑA","AURA","ELENA","Despacho del Superintendente Delegado para la Propiedad Industrial","- Grupo de Trabajo de Vía Gubernativa","Despacho del Superintendente Delegado para la Propiedad Industrial - Grupo de Trabajo de Vía Gubernativa","Profesional Universitario (Prov)","PROFESIONAL",2044,"05"]
[null,null,null,null,null,null,null,null,null,null,null,null,null,null,null,"2017-03-13",null,null,null,null,null,null,null,null,null,null,44.899999999999899,"NO SATISFACTORIO",null,null,null,null,null,null,null,null,null,null,null,null,null,null,null,null,null,null,null,null,null,null,null,null,53068839,"RÍOS","SEGURA","DIANA","CAROLINA","Despacho del Superintendente Delegado para Asuntos Jurisdiccionales","- Grupo de Trabajo de Secretaría","Despacho del Superintendente Delegado para Asuntos Jurisdiccionales - Grupo de Trabajo de Secretaría","Técnico Administrativo (Prov)","TECNICO",3124,11]
[null,null,null,null,null,null,null,null,null,null,null,null,null,null,null,"2017-03-14",null,null,null,null,null,null,null,null,null,null,44.999999999999901,"NO SATISFACTORIO",null,null,null,null,null,null,null,null,null,null,null,null,null,null,null,null,null,null,null,null,null,null,null,null,53140202,"RIVERA","CELIS","DIANA","CAROLINA","Oficina de Servicios al Consumidor y de Apoyo Empresarial","- Grupo de Trabajo de Atención al Ciudadano","Oficina de Servicios al Consumidor y de Apoyo Empresarial - Grupo de Trabajo de Atención al Ciudadano","Profesional Universitario (Prov)","PROFESIONAL",2044,"01"]
[null,null,null,null,null,null,null,null,null,null,null,null,null,null,null,"2017-03-15",null,null,null,null,null,null,null,null,null,null,45.099999999999902,"NO SATISFACTORIO",null,null,null,null,null,null,null,null,null,null,null,null,null,null,null,null,null,null,null,null,null,null,null,null,36301229,"RIVERA","GÓMEZ","DIANA","MARCELA","Oficina Asesora Jurídica","- Grupo de Trabajo de Gestión Judicial","Oficina Asesora Jurídica - Grupo de Trabajo de Gestión Judicial","Profesional Universitario (Prov)","PROFESIONAL",2044,"03"]
[null,null,null,null,null,null,null,null,null,null,null,null,null,null,null,"2017-03-16",null,null,null,null,null,null,null,null,null,null,45.199999999999903,"NO SATISFACTORIO",null,null,null,null,null,null,null,null,null,null,null,null,null,null,null,null,null,null,null,null,null,null,null,null,20957925,"RIVERA","HERNÁNDEZ","DIANA","PATRICIA","Dirección de Investigaciones de Protección de Usuarios de Servicios de Comunicaciones","- Grupo de Trabajo de Investigaciones Administrativas de Protección de Usuarios de Servicios de Comunicaciones","Dirección de Investigaciones de Protección de Usuarios de Servicios de Comunicaciones - Grupo de Trabajo de Investigaciones Administrativas de Protección de Usuarios de Servicios de Comunicaciones","Profesional Universitario (Prov)","PROFESIONAL",2044,"09"]
[null,null,null,null,null,null,null,null,null,null,null,null,null,null,null,"2017-03-17",null,null,null,null,null,null,null,null,null,null,45.299999999999898,"NO SATISFACTORIO",null,null,null,null,null,null,null,null,null,null,null,null,null,null,null,null,null,null,null,null,null,null,null,null,52436328,"RIVERA","ZORRO","JOHANNA","PATRICIA","Despacho del Superintendente Delegado para la Propiedad Industrial","- Grupo de Trabajo de Vía Gubernativa","Despacho del Superintendente Delegado para la Propiedad Industrial - Grupo de Trabajo de Vía Gubernativa","Profesional Universitario (Prov)","PROFESIONAL",2044,"07"]
[null,null,null,null,null,null,null,null,null,null,null,null,null,null,null,"2017-03-18",null,null,null,null,null,null,null,null,null,null,45.399999999999899,"NO SATISFACTORIO",null,null,null,null,null,null,null,null,null,null,null,null,null,null,null,null,null,null,null,null,null,null,null,null,53052801,"RIVEROS","GOMEZ","MARÍA","DEL PILAR","Oficina Asesora Jurídica","- Grupo de Trabajo de Cobro Coactivo","Oficina Asesora Jurídica - Grupo de Trabajo de Cobro Coactivo","Profesional Universitario (Prov)","PROFESIONAL",2044,"05"]
[null,null,null,null,null,null,null,null,null,null,null,null,null,null,null,"2017-03-19",null,null,null,null,null,null,null,null,null,null,45.499999999999901,"NO SATISFACTORIO",null,null,null,null,null,null,null,null,null,null,null,null,null,null,null,null,null,null,null,null,null,null,null,null,10137841,"ROBLEDO","DEL","PABLO","FELIPE","Despacho del Superintendente","","Despacho del Superintendente ","Superintendente","DIRECTIVO","0030",25]
[null,null,null,null,null,null,null,null,null,null,null,null,null,null,null,"2017-03-20",null,null,null,null,null,null,null,null,null,null,45.599999999999902,"NO SATISFACTORIO",null,null,null,null,null,null,null,null,null,null,null,null,null,null,null,null,null,null,null,null,null,null,null,null,73077821,"RODAS","BLANDÓN","LUIS","ALBERTO","Dirección de Signos Distintivos",null,"Dirección de Signos Distintivos ","Auxiliar Administrativo (Prov)","ASISTENCIAL",4044,11]
[null,null,null,null,null,null,null,null,null,null,null,null,null,null,null,"2017-03-21",null,null,null,null,null,null,null,null,null,null,45.699999999999903,"NO SATISFACTORIO",null,null,null,null,null,null,null,null,null,null,null,null,null,null,null,null,null,null,null,null,null,null,null,null,1032439618,"RODELO","PINTO","STEFANIA"," -","Despacho del Superintendente Delegado para Asuntos Jurisdiccionales","- Grupo de Trabajo de Calificación","Despacho del Superintendente Delegado para Asuntos Jurisdiccionales - Grupo de Trabajo de Calificación","Profesional Universitario (Prov)","PROFESIONAL",2044,"01"]
[null,null,null,null,null,null,null,null,null,null,null,null,null,null,null,"2017-03-22",null,null,null,null,null,null,null,null,null,null,45.799999999999898,"NO SATISFACTORIO",null,null,null,null,null,null,null,null,null,null,null,null,null,null,null,null,null,null,null,null,null,null,null,null,79846396,"RODRÍGUEZ","AMADOR","JOSÉ","ALEJANDRO","Oficina Asesora de Planeación","- Grupo de Trabajo de Estudios Económicos","Oficina Asesora de Planeación - Grupo de Trabajo de Estudios Económicos","Profesional Universitario (Prov)","PROFESIONAL",2044,"03"]
[null,null,null,null,null,null,null,null,null,null,null,null,null,null,null,"2017-03-23",null,null,null,null,null,null,null,null,null,null,45.899999999999899,"NO SATISFACTORIO",null,null,null,null,null,null,null,null,null,null,null,null,null,null,null,null,null,null,null,null,null,null,null,null,1061724125,"RODRÍGUEZ","ANTE","HÉCTOR","JOSÉ","Despacho del Superintendente","- Grupo de Trabajo de Apoyo a la Red Nacional de Protección al Consumidor","Despacho del Superintendente - Grupo de Trabajo de Apoyo a la Red Nacional de Protección al Consumidor","Técnico Administrativo (Prov)","TECNICO",3124,11]
[null,null,null,null,null,null,null,null,null,null,null,null,null,null,null,"2017-03-24",null,null,null,null,null,null,null,null,null,null,45.999999999999901,"NO SATISFACTORIO",null,null,null,null,null,null,null,null,null,null,null,null,null,null,null,null,null,null,null,null,null,null,null,null,53063688,"RODRIGUEZ","BRICEÑO","MARIA","ALEJANDRA","Oficina de Servicios al Consumidor y de Apoyo Empresarial","- Grupo de Trabajo de Comunicación",{"$f":"CONCATENATE(BF451,\" \",BG451)","v":"Oficina de Servicios al Consumidor y de Apoyo Empresarial - Grupo de Trabajo de Comunicación"},"Técnico Administrativo (Prov)","TECNICO",3124,11]
["NO EVALUADO",0,null,null,null,null,null,null,null,null,null,null,null,null,null,"2017-03-25",null,null,null,null,null,null,null,null,null,null,46.099999999999902,"NO SATISFACTORIO",null,null,null,null,null,null,null,null,null,null,null,null,null,null,null,null,null,null,null,null,null,null,null,null,79696966,"RODRÍGUEZ","CHÁVEZ","ERITH","GERMAN","Dirección de Investigaciones de Protección al Consumidor","- Grupo de Trabajo de Supervisión Empresarial y Seguridad de Producto","Dirección de Investigaciones de Protección al Consumidor - Grupo de Trabajo de Supervisión Empresarial y Seguridad de Producto","Profesional Universitario (Prov)","PROFESIONAL",2044,"03"]
["BAJO",6,null,null,null,null,null,null,null,null,null,null,null,null,null,"2017-03-26",null,null,null,null,null,null,null,null,null,null,46.199999999999903,"NO SATISFACTORIO",null,null,null,null,null,null,null,null,null,null,null,null,null,null,null,null,null,null,null,null,null,null,null,null,80815921,"RODRÍGUEZ","CHIZABA","MIGUEL","ANGEL","Dirección Administrativa","- Grupo de Trabajo de Gestión Documental y Recursos Físicos","Dirección Administrativa - Grupo de Trabajo de Gestión Documental y Recursos Físicos","Técnico Administrativo (Prov)","TECNICO",3124,"07"]
["ACEPTABLE",9,null,null,null,null,null,null,null,null,null,null,null,null,null,"2017-03-27",null,null,null,null,null,null,null,null,null,null,46.299999999999898,"NO SATISFACTORIO",null,null,null,null,null,null,null,null,null,null,null,null,null,null,null,null,null,null,null,null,null,null,null,null,1020733211,"RODRÍGUEZ","CORZO","CRISTINA"," -","Oficina Asesora de Planeación","- Grupo de Trabajo de Asuntos Internacionales","Oficina Asesora de Planeación - Grupo de Trabajo de Asuntos Internacionales","Profesional Universitario (Prov)","PROFESIONAL",2044,"07"]
["ALTO",12,null,null,null,null,null,null,null,null,null,null,null,null,null,"2017-03-28",null,null,null,null,null,null,null,null,null,null,46.399999999999899,"NO SATISFACTORIO",null,null,null,null,null,null,null,null,null,null,null,null,null,null,null,null,null,null,null,null,null,null,null,null,1049609521,"RODRÍGUEZ","FAJARDO","MÓNICA","JOHANNA","Despacho del Superintendente Delegado para la Protección de la Competencia","- Grupo de Trabajo de Protección y Promoción de la Competencia","Despacho del Superintendente Delegado para la Protección de la Competencia - Grupo de Trabajo de Protección y Promoción de la Competencia","Profesional Universitario (Prov)","PROFESIONAL",2044,"03"]
["MUY ALTO",15,null,null,null,null,null,null,null,null,null,null,null,null,null,"2017-03-29",null,null,null,null,null,null,null,null,null,null,46.499999999999901,"NO SATISFACTORIO",null,null,null,null,null,null,null,null,null,null,null,null,null,null,null,null,null,null,null,null,null,null,null,null,52692770,"RODRÍGUEZ","FLOREZ","VIVIANA","ANDREA","Dirección Administrativa","- Grupo de Trabajo de Gestión Documental y Recursos Físicos","Dirección Administrativa - Grupo de Trabajo de Gestión Documental y Recursos Físicos","Profesional Universitario (Prov)","PROFESIONAL",2044,"07"]
[null,null,null,null,null,null,null,null,null,null,null,null,null,null,null,"2017-03-30",null,null,null,null,null,null,null,null,null,null,46.599999999999902,"NO SATISFACTORIO",null,null,null,null,null,null,null,null,null,null,null,null,null,null,null,null,null,null,null,null,null,null,null,null,51961385,"RODRÍGUEZ","GARCÍA","MÓNICA","IVETT","Despacho del Superintendente Delegado para Asuntos Jurisdiccionales","- Grupo de Trabajo de Defensa del Consumidor","Despacho del Superintendente Delegado para Asuntos Jurisdiccionales - Grupo de Trabajo de Defensa del Consumidor","Profesional Especializado (E)","PROFESIONAL",2028,13]
[null,null,null,null,null,null,null,null,null,null,null,null,null,null,null,"2017-03-31",null,null,null,null,null,null,null,null,null,null,46.699999999999903,"NO SATISFACTORIO",null,null,null,null,null,null,null,null,null,null,null,null,null,null,null,null,null,null,null,null,null,null,null,null,1020725250,"RODRÍGUEZ","GARCÍA","SANTIAGO","DAVID","Dirección de Cámaras de Comercio","- Grupo de Trabajo de Vigilancia de las Cámaras de Comercio y a los Comerciantes","Dirección de Cámaras de Comercio - Grupo de Trabajo de Vigilancia de las Cámaras de Comercio y a los Comerciantes","Profesional Universitario (Prov)","PROFESIONAL",2044,"05"]
["Período de prueba-Compromiso 1",{"$f":"'F11. EVA P. PRUEBA'!F35","v":0},null,null,null,null,null,null,null,null,null,null,null,null,null,"2017-04-01",null,null,null,null,null,null,null,null,null,null,46.799999999999898,"NO SATISFACTORIO",null,null,null,null,null,null,null,null,null,null,null,null,null,null,null,null,null,null,null,null,null,null,null,null,51931796,"RODRÍGUEZ","GONZÁLEZ","JENNY"," -","Oficina de Tecnología e Informática","- Grupo de Trabajo de Sistemas de Información","Oficina de Tecnología e Informática - Grupo de Trabajo de Sistemas de Información","Profesional Universitario (E)","PROFESIONAL",2044,10]
["Período de prueba-Compromiso 2",{"$f":"'F11. EVA P. PRUEBA'!F36","v":0},null,null,null,null,null,null,null,null,null,null,null,null,null,"2017-04-02",null,null,null,null,null,null,null,null,null,null,46.899999999999899,"NO SATISFACTORIO",null,null,null,null,null,null,null,null,null,null,null,null,null,null,null,null,null,null,null,null,null,null,null,null,1113646229,"RODRIGUEZ","IZA","ALVARO","JOSÉ","Oficina Asesora Jurídica","- Grupo de Trabajo de Gestión Judicial","Oficina Asesora Jurídica - Grupo de Trabajo de Gestión Judicial","Profesional Universitario (Prov)","PROFESIONAL",2044,"01"]
["Período de prueba-Compromiso 3",{"$f":"'F11. EVA P. PRUEBA'!F38","v":0},null,null,null,null,null,null,null,null,null,null,null,null,null,"2017-04-03",null,null,null,null,null,null,null,null,null,null,46.999999999999901,"NO SATISFACTORIO",null,null,null,null,null,null,null,null,null,null,null,null,null,null,null,null,null,null,null,null,null,null,null,null,1031126600,"RODRÍGUEZ","JOLEANES","DIEGO","ARMANDO","Dirección de Investigaciones para el Control y Verificación de Reglamentos Técnicos y Metrología Legal","- Grupo de Trabajo de Inspección y Vigilancia de Metrología Legal","Dirección de Investigaciones para el Control y Verificación de Reglamentos Técnicos y Metrología Legal - Grupo de Trabajo de Inspección y Vigilancia de Metrología Legal","Profesional Universitario (Prov)","PROFESIONAL",2044,10]
["Período de prueba-Competencia 1",{"$f":"'F11. EVA P. PRUEBA'!A46","v":0},null,null,null,null,null,null,null,null,null,null,null,null,null,"2017-04-04",null,null,null,null,null,null,null,null,null,null,47.099999999999902,"NO SATISFACTORIO",null,null,null,null,null,null,null,null,null,null,null,null,null,null,null,null,null,null,null,null,null,null,null,null,52588562,"RODRÍGUEZ","LIZCANO","MARCELA"," -","Secretaría General","- Grupo de Trabajo de Talento Humano","Secretaría General - Grupo de Trabajo de Talento Humano","Profesional Universitario (Prov)","PROFESIONAL",2044,"03"]
["Período de prueba-Competencia 2",{"$f":"'F11. EVA P. PRUEBA'!A48","v":0},null,null,null,null,null,null,null,null,null,null,null,null,null,"2017-04-05",null,null,null,null,null,null,null,null,null,null,47.199999999999903,"NO SATISFACTORIO",null,null,null,null,null,null,null,null,null,null,null,null,null,null,null,null,null,null,null,null,null,null,null,null,1032362003,"RODRÍGUEZ","MESA","ANDRÉS","FERNANDO","Dirección de Cámaras de Comercio","- Grupo de Trabajo de Trámites Administrativos","Dirección de Cámaras de Comercio - Grupo de Trabajo de Trámites Administrativos","Profesional Universitario (Prov)","PROFESIONAL",2044,"01"]
["Período de prueba-Competencia 3",{"$f":"'F11. EVA P. PRUEBA'!A50","v":0},null,null,null,null,null,null,null,null,null,null,null,null,null,"2017-04-06",null,null,null,null,null,null,null,null,null,null,47.299999999999898,"NO SATISFACTORIO",null,null,null,null,null,null,null,null,null,null,null,null,null,null,null,null,null,null,null,null,null,null,null,null,79040093,"RODRÍGUEZ","MORENO","ORLANDO"," -","Dirección Administrativa","- Grupo de Trabajo de Gestión Documental y Recursos Físicos","Dirección Administrativa - Grupo de Trabajo de Gestión Documental y Recursos Físicos","Técnico Administrativo (E)","TECNICO",3124,11]
["Período de prueba -Competencia 4",{"$f":"'F11. EVA P. PRUEBA'!A52","v":0},null,null,null,null,null,null,null,null,null,null,null,null,null,"2017-04-08",null,null,null,null,null,null,null,null,null,null,47.399999999999899,"NO SATISFACTORIO",null,null,null,null,null,null,null,null,null,null,null,null,null,null,null,null,null,null,null,null,null,null,null,null,1110517675,"RODRÍGUEZ","ORTIZ","DIANA","PATRICIA","Despacho del Superintendente Delegado para la Protección de la Competencia","- Grupo de Trabajo de Integraciones Empresariales","Despacho del Superintendente Delegado para la Protección de la Competencia - Grupo de Trabajo de Integraciones Empresariales","Profesional Universitario (Prov)","PROFESIONAL",2044,"05"]
["Período semestral u ordinario- Compromiso 1",{"$f":"'F2. COMP. LAB Y COM COMPOR'!H36","v":0},null,null,null,null,null,null,null,null,null,null,null,null,null,"2017-04-09",null,null,null,null,null,null,null,null,null,null,47.499999999999901,"NO SATISFACTORIO",null,null,null,null,null,null,null,null,null,null,null,null,null,null,null,null,null,null,null,null,null,null,null,null,91203739,"RODRÍGUEZ","PÉREZ","JAVIER","OSWALDO","Dirección de Signos Distintivos","- Grupo de Trabajo de Registro","Dirección de Signos Distintivos - Grupo de Trabajo de Registro","Técnico Administrativo (E)","TECNICO",3124,11]
["Período semestral u ordinario-Compromiso 2",{"$f":"'F2. COMP. LAB Y COM COMPOR'!H38","v":0},null,null,null,null,null,null,null,null,null,null,null,null,null,"2017-04-10",null,null,null,null,null,null,null,null,null,null,47.599999999999902,"NO SATISFACTORIO",null,null,null,null,null,null,null,null,null,null,null,null,null,null,null,null,null,null,null,null,null,null,null,null,79373942,"RODRÍGUEZ","RODRÍGUEZ","FERNANDO","AUGUSTO","Oficina de Tecnología e Informática","- Grupo de Trabajo de Sistemas de Información","Oficina de Tecnología e Informática - Grupo de Trabajo de Sistemas de Información","Técnico Administrativo","TECNICO",3124,15]
["Período semestral u ordinario- Compromiso 3",{"$f":"'F2. COMP. LAB Y COM COMPOR'!H40","v":0},null,null,null,null,null,null,null,null,null,null,null,null,null,"2017-04-11",null,null,null,null,null,null,null,null,null,null,47.699999999999903,"NO SATISFACTORIO",null,null,null,null,null,null,null,null,null,null,null,null,null,null,null,null,null,null,null,null,null,null,null,null,52432260,"RODRÍGUEZ","TEJADA","SANDRA","LILIANA","Dirección Financiera","","Dirección Financiera ","Auxiliar Administrativo (Prov)","ASISTENCIAL",4044,"08"]
["Período semestral u ordinario- Compromiso 4",{"$f":"'F2. COMP. LAB Y COM COMPOR'!H42","v":0},null,null,null,null,null,null,null,null,null,null,null,null,null,"2017-04-12",null,null,null,null,null,null,null,null,null,null,47.799999999999898,"NO SATISFACTORIO",null,null,null,null,null,null,null,null,null,null,null,null,null,null,null,null,null,null,null,null,null,null,null,null,52813017,"ROJAS","BELTRÁN","SANDRA","MILENA","Dirección de Investigaciones de Protección al Consumidor",null,"Dirección de Investigaciones de Protección al Consumidor ","Auxiliar Administrativo (Prov)","ASISTENCIAL",4044,11]
["Período semestral u ordinario- Compromiso 5",{"$f":"'F2. COMP. LAB Y COM COMPOR'!H44","v":0},null,null,null,null,null,null,null,null,null,null,null,null,null,"2017-04-13",null,null,null,null,null,null,null,null,null,null,47.899999999999899,"NO SATISFACTORIO",null,null,null,null,null,null,null,null,null,null,null,null,null,null,null,null,null,null,null,null,null,null,null,null,80190371,"ROJAS","GUACANEME","ANDRES","EMILIO","Dirección Administrativa",null,"Dirección Administrativa ","Profesional Universitario (Prov)","PROFESIONAL",2044,"01"]
["Período semestral u ordinario- Competencia 1",{"$f":"'F2. COMP. LAB Y COM COMPOR'!B50","v":0},null,null,null,null,null,null,null,null,null,null,null,null,null,"2017-04-14",null,null,null,null,null,null,null,null,null,null,47.999999999999901,"NO SATISFACTORIO",null,null,null,null,null,null,null,null,null,null,null,null,null,null,null,null,null,null,null,null,null,null,null,null,79836739,"ROJAS","RÍOS","MARLON"," -","Despacho del Superintendente Delegado para la Protección del Consumidor","","Despacho del Superintendente Delegado para la Protección del Consumidor ","Profesional Universitario (Prov)","PROFESIONAL",2044,"01"]
["Período semestral u ordinario- Competencia 2",{"$f":"'F2. COMP. LAB Y COM COMPOR'!B52","v":0},null,null,null,null,null,null,null,null,null,null,null,null,null,"2017-04-15",null,null,null,null,null,null,null,null,null,null,48.099999999999902,"NO SATISFACTORIO",null,null,null,null,null,null,null,null,null,null,null,null,null,null,null,null,null,null,null,null,null,null,null,null,1032387271,"ROJAS","ROJAS","LEIDY","MARCELA","Dirección de Signos Distintivos","- Grupo de Trabajo de Oposiciones y Cancelaciones","Dirección de Signos Distintivos - Grupo de Trabajo de Oposiciones y Cancelaciones","Profesional Universitario (Prov)","PROFESIONAL",2044,"03"]
["Período semestral u ordinario- Competencia 3",{"$f":"'F2. COMP. LAB Y COM COMPOR'!B54","v":0},null,null,null,null,null,null,null,null,null,null,null,null,null,"2017-04-16",null,null,null,null,null,null,null,null,null,null,48.199999999999903,"NO SATISFACTORIO",null,null,null,null,null,null,null,null,null,null,null,null,null,null,null,null,null,null,null,null,null,null,null,null,52149418,"ROJAS","VALDERRAMA","GRACIELA"," -","Despacho del Superintendente Delegado para Asuntos Jurisdiccionales","- Grupo de Trabajo de Secretaría","Despacho del Superintendente Delegado para Asuntos Jurisdiccionales - Grupo de Trabajo de Secretaría","Técnico Administrativo (Prov)","TECNICO",3124,11]
["Período semestral u ordinario- Competencia 4",{"$f":"'F2. COMP. LAB Y COM COMPOR'!B56","v":0},null,null,null,null,null,null,null,null,null,null,null,null,null,"2017-04-18",null,null,null,null,null,null,null,null,null,null,48.299999999999898,"NO SATISFACTORIO",null,null,null,null,null,null,null,null,null,null,null,null,null,null,null,null,null,null,null,null,null,null,null,null,80880938,"ROJAS","VEGA","LEONARDO"," -","Dirección de Nuevas Creaciones","- Grupo de Trabajo del Sector de Ingenierías","Dirección de Nuevas Creaciones - Grupo de Trabajo del Sector de Ingenierías","Profesional Universitario (Prov)","PROFESIONAL",2044,"03"]
[null,null,null,null,null,null,null,null,null,null,null,null,null,null,null,"2017-04-19",null,null,null,null,null,null,null,null,null,null,48.399999999999899,"NO SATISFACTORIO",null,null,null,null,null,null,null,null,null,null,null,null,null,null,null,null,null,null,null,null,null,null,null,null,79569611,"ROLDÁN","ROJAS","DANIEL","ERNESTO","Dirección de Investigaciones para el Control y Verificación de Reglamentos Técnicos y Metrología Legal","","Dirección de Investigaciones para el Control y Verificación de Reglamentos Técnicos y Metrología Legal ","Profesional Universitario (Prov)","PROFESIONAL",2044,11]
[null,null,null,null,null,null,null,null,null,null,null,null,null,null,null,"2017-04-20",null,null,null,null,null,null,null,null,null,null,48.499999999999901,"NO SATISFACTORIO",null,null,null,null,null,null,null,null,null,null,null,null,null,null,null,null,null,null,null,null,null,null,null,null,53010002,"ROMERO","CARVAJAL","ANGELA","DEL PILAR","Dirección de Signos Distintivos","- Grupo de Trabajo de Registro","Dirección de Signos Distintivos - Grupo de Trabajo de Registro","Profesional Universitario (Prov)","PROFESIONAL",2044,"03"]
["Período de prueba",null,null,null,null,null,null,null,null,null,null,null,null,null,null,"2017-04-21",null,null,null,null,null,null,null,null,null,null,48.599999999999902,"NO SATISFACTORIO",null,null,null,null,null,null,null,null,null,null,null,null,null,null,null,null,null,null,null,null,null,null,null,null,1136882954,"ROMERO","FLÓREZ","CAMILO"," -","Despacho del Superintendente Delegado para la Protección de la Competencia","- Grupo de Trabajo de Abogacía de la Competencia","Despacho del Superintendente Delegado para la Protección de la Competencia - Grupo de Trabajo de Abogacía de la Competencia","Profesional Universitario (Prov)","PROFESIONAL",2044,"01"]
["Período semestral u ordinario",null,null,null,null,null,null,null,null,null,null,null,null,null,null,"2017-04-22",null,null,null,null,null,null,null,null,null,null,48.699999999999903,"NO SATISFACTORIO",null,null,null,null,null,null,null,null,null,null,null,null,null,null,null,null,null,null,null,null,null,null,null,null,79185081,"ROMERO","ROMERO","EDWIN","ARBEY","Dirección Administrativa","- Grupo de Trabajo de Contratación","Dirección Administrativa - Grupo de Trabajo de Contratación","Profesional Especializado (Prov)","PROFESIONAL",2028,17]
[null,null,null,null,null,null,null,null,null,null,null,null,null,null,null,"2017-04-23",null,null,null,null,null,null,null,null,null,null,48.799999999999898,"NO SATISFACTORIO",null,null,null,null,null,null,null,null,null,null,null,null,null,null,null,null,null,null,null,null,null,null,null,null,1061437,"RUDA","TEQUIA","JOSE","GUSTAVO","Dirección Administrativa","- Grupo de Trabajo de Gestión Documental y Recursos Físicos","Dirección Administrativa - Grupo de Trabajo de Gestión Documental y Recursos Físicos","Técnico Administrativo (E)","TECNICO",3124,11]
[null,null,null,null,null,null,null,null,null,null,null,null,null,null,null,"2017-04-24",null,null,null,null,null,null,null,null,null,null,48.899999999999899,"NO SATISFACTORIO",null,null,null,null,null,null,null,null,null,null,null,null,null,null,null,null,null,null,null,null,null,null,null,null,51991534,"RUEDA","FUENTES","MARTHA","LUCÍA","Despacho del Superintendente Delegado para la Protección de la Competencia","","Despacho del Superintendente Delegado para la Protección de la Competencia ","Secretario Ejecutivo (E)","ASISTENCIAL",4210,18]
[null,null,null,null,null,null,null,null,null,null,null,null,null,null,null,"2017-04-25",null,null,null,null,null,null,null,null,null,null,48.999999999999901,"NO SATISFACTORIO",null,null,null,null,null,null,null,null,null,null,null,null,null,null,null,null,null,null,null,null,null,null,null,null,52034884,"RUÍZ","ÁLVAREZ","LUZ","EDITH","Secretaría General","- Grupo de Trabajo de Notificaciones y Certificaciones","Secretaría General - Grupo de Trabajo de Notificaciones y Certificaciones","Técnico Administrativo (Prov)","TECNICO",3124,"07"]
[null,null,null,null,null,null,null,null,null,null,null,null,null,null,null,"2017-04-26",null,null,null,null,null,null,null,null,null,null,49.099999999999902,"NO SATISFACTORIO",null,null,null,null,null,null,null,null,null,null,null,null,null,null,null,null,null,null,null,null,null,null,null,null,19450734,"RUÍZ","PLAZAS","CARLOS","HERNANDO","Dirección de Signos Distintivos","- Grupo de Trabajo de Forma","Dirección de Signos Distintivos - Grupo de Trabajo de Forma","Profesional Universitario (E)","PROFESIONAL",2044,10]
[null,null,null,null,null,null,null,null,null,null,null,null,null,null,null,"2017-04-27",null,null,null,null,null,null,null,null,null,null,49.199999999999903,"NO SATISFACTORIO",null,null,null,null,null,null,null,null,null,null,null,null,null,null,null,null,null,null,null,null,null,null,null,null,52970877,"SAAVEDRA","LOZANO","VIVIANA"," -","Oficina de Tecnología e Informática","- Grupo de Trabajo de Infraestructura Tecnológica y Seguridad","Oficina de Tecnología e Informática - Grupo de Trabajo de Infraestructura Tecnológica y Seguridad","Profesional Universitario (Prov)","PROFESIONAL",2044,"09"]
[null,null,null,null,null,null,null,null,null,null,null,null,null,null,null,"2017-04-28",null,null,null,null,null,null,null,null,null,null,49.299999999999898,"NO SATISFACTORIO",null,null,null,null,null,null,null,null,null,null,null,null,null,null,null,null,null,null,null,null,null,null,null,null,9397666,"SAAVEDRA","SIABATTO","FREDDY","ALEXANDER","Dirección de Nuevas Creaciones","","Dirección de Nuevas Creaciones ","Profesional Universitario (Prov)","PROFESIONAL",2044,"07"]
[null,null,null,null,null,null,null,null,null,null,null,null,null,null,null,"2017-04-29",null,null,null,null,null,null,null,null,null,null,49.399999999999899,"NO SATISFACTORIO",null,null,null,null,null,null,null,null,null,null,null,null,null,null,null,null,null,null,null,null,null,null,null,null,1136879992,"SABOGAL","MORENO","DANIEL"," -","Despacho del Superintendente Delegado para la Protección de la Competencia","- Grupo de Trabajo Interdisciplinario de Colusiones","Despacho del Superintendente Delegado para la Protección de la Competencia - Grupo de Trabajo Interdisciplinario de Colusiones","Profesional Universitario (Prov)","PROFESIONAL",2044,"03"]
[null,null,null,null,null,null,null,null,null,null,null,null,null,null,null,"2017-04-30",null,null,null,null,null,null,null,null,null,null,49.499999999999901,"NO SATISFACTORIO",null,null,null,null,null,null,null,null,null,null,null,null,null,null,null,null,null,null,null,null,null,null,null,null,65741132,"SAÉNZ",null,"BLANCA","YANET","Oficina de Tecnología e Informática","- Grupo de Trabajo de Gestión de Información y Proyectos Informáticos","Oficina de Tecnología e Informática - Grupo de Trabajo de Gestión de Información y Proyectos Informáticos","Profesional Universitario (Prov)","PROFESIONAL",2044,"05"]
[null,null,null,null,null,null,null,null,null,null,null,null,null,null,null,"2017-05-01",null,null,null,null,null,null,null,null,null,null,49.599999999999902,"NO SATISFACTORIO",null,null,null,null,null,null,null,null,null,null,null,null,null,null,null,null,null,null,null,null,null,null,null,null,52250062,"SÁENZ","URREGO","LILIANA"," -","Dirección de Signos Distintivos",null,"Dirección de Signos Distintivos ","Profesional Universitario (Prov)","PROFESIONAL",2044,11]
[null,null,null,null,null,null,null,null,null,null,null,null,null,null,null,"2017-05-02",null,null,null,null,null,null,null,null,null,null,49.699999999999903,"NO SATISFACTORIO",null,null,null,null,null,null,null,null,null,null,null,null,null,null,null,null,null,null,null,null,null,null,null,null,1032383783,"SALAMANCA","ARDILA","KAREN","ESTEFANY","Dirección Administrativa","- Grupo de Trabajo de Gestión Documental y Recursos Físicos","Dirección Administrativa - Grupo de Trabajo de Gestión Documental y Recursos Físicos","Auxiliar Administrativo (Prov)","ASISTENCIAL",4044,"08"]
[null,null,null,null,null,null,null,null,null,null,null,null,null,null,null,"2017-05-03",null,null,null,null,null,null,null,null,null,null,49.799999999999898,"NO SATISFACTORIO",null,null,null,null,null,null,null,null,null,null,null,null,null,null,null,null,null,null,null,null,null,null,null,null,79339592,"SALAMANCA","CRISTANCHO","PEDRO","JOAQUIN","Dirección de Investigaciones de Protección de Usuarios de Servicios de Comunicaciones","- Grupo de Trabajo de Supervisión, Control y Vigilancia de los Regímenes de Protección de Usuarios de Servicios de Comunicaciones","Dirección de Investigaciones de Protección de Usuarios de Servicios de Comunicaciones - Grupo de Trabajo de Supervisión, Control y Vigilancia de los Regímenes de Protección de Usuarios de Servicios de Comunicaciones","Auxiliar Administrativo (Prov)","ASISTENCIAL",4044,"08"]
[null,null,null,null,null,null,null,null,null,null,null,null,null,null,null,"2017-05-04",null,null,null,null,null,null,null,null,null,null,49.899999999999899,"NO SATISFACTORIO",null,null,null,null,null,null,null,null,null,null,null,null,null,null,null,null,null,null,null,null,null,null,null,null,19453453,"SALAMANCA","RODRIGUEZ","LUIS","EDUARDO","Oficina Asesora Jurídica","- Grupo de Trabajo de Gestión Judicial","Oficina Asesora Jurídica - Grupo de Trabajo de Gestión Judicial","Profesional Universitario (Prov)","PROFESIONAL",2044,11]
[null,null,null,null,null,null,null,null,null,null,null,null,null,null,null,"2017-05-05",null,null,null,null,null,null,null,null,null,null,49.999999999999901,"NO SATISFACTORIO",null,null,null,null,null,null,null,null,null,null,null,null,null,null,null,null,null,null,null,null,null,null,null,null,39585014,"SALAS","GARCÍA","LINA","MARCELA","Oficina Asesora Jurídica","- Grupo de Trabajo de Regulación","Oficina Asesora Jurídica - Grupo de Trabajo de Regulación","Profesional Universitario (Prov)","PROFESIONAL",2044,"07"]
[null,null,null,null,null,null,null,null,null,null,null,null,null,null,null,"2017-05-06",null,null,null,null,null,null,null,null,null,null,50.099999999999902,"NO SATISFACTORIO",null,null,null,null,null,null,null,null,null,null,null,null,null,null,null,null,null,null,null,null,null,null,null,null,8834916,"SALAS","RAMOS","ELTHON","ADOLFO","Dirección Administrativa","- Grupo de Trabajo de Gestión Documental y Recursos Físicos","Dirección Administrativa - Grupo de Trabajo de Gestión Documental y Recursos Físicos","Operario Calificado  (Prov)","ASISTENCIAL",4169,"09"]
[null,null,null,null,null,null,null,null,null,null,null,null,null,null,null,"2017-05-07",null,null,null,null,null,null,null,null,null,null,50.199999999999903,"NO SATISFACTORIO",null,null,null,null,null,null,null,null,null,null,null,null,null,null,null,null,null,null,null,null,null,null,null,null,79760147,"SALAZAR","ÁRIAS","WILMER","ARLEY","Despacho del Superintendente Delegado para la Protección de la Competencia","- Grupo de Trabajo de Prácticas Restrictivas de la Competencia","Despacho del Superintendente Delegado para la Protección de la Competencia - Grupo de Trabajo de Prácticas Restrictivas de la Competencia","Profesional Especializado (Prov)","PROFESIONAL",2028,17]
[null,null,null,null,null,null,null,null,null,null,null,null,null,null,null,"2017-05-08",null,null,null,null,null,null,null,null,null,null,50.299999999999898,"NO SATISFACTORIO",null,null,null,null,null,null,null,null,null,null,null,null,null,null,null,null,null,null,null,null,null,null,null,null,79523823,"SALAZAR","LÓPEZ","JOSÉ","LUIS","Dirección de Nuevas Creaciones",null,"Dirección de Nuevas Creaciones ","Director de Superintendencia (En Comisión)","DIRECTIVO","0105",11]
[null,null,null,null,null,null,null,null,null,null,null,null,null,null,null,"2017-05-09",null,null,null,null,null,null,null,null,null,null,50.399999999999899,"NO SATISFACTORIO",null,null,null,null,null,null,null,null,null,null,null,null,null,null,null,null,null,null,null,null,null,null,null,null,79155697,"SALAZAR","MÚÑOZ","CARLOS","ENRIQUE","Dirección de Investigación de Protección de Datos Personales","","Dirección de Investigación de Protección de Datos Personales ","Director de Superintendencia","DIRECTIVO","0105",11]
[null,null,null,null,null,null,null,null,null,null,null,null,null,null,null,"2017-05-10",null,null,null,null,null,null,null,null,null,null,50.499999999999901,"NO SATISFACTORIO",null,null,null,null,null,null,null,null,null,null,null,null,null,null,null,null,null,null,null,null,null,null,null,null,63539537,"SALAZAR","REYES","LAURA","XIMENA","Oficina de Control Interno",null,"Oficina de Control Interno ","Profesional Universitario (Prov)","PROFESIONAL",2044,"07"]
[null,null,null,null,null,null,null,null,null,null,null,null,null,null,null,"2017-05-11",null,null,null,null,null,null,null,null,null,null,50.599999999999902,"NO SATISFACTORIO",null,null,null,null,null,null,null,null,null,null,null,null,null,null,null,null,null,null,null,null,null,null,null,null,1032371503,"SANCHEZ","CASALLAS","ADRIANA","MARCELA","Despacho del Superintendente Delegado para Asuntos Jurisdiccionales","- Grupo de Trabajo de Defensa del Consumidor","Despacho del Superintendente Delegado para Asuntos Jurisdiccionales - Grupo de Trabajo de Defensa del Consumidor","Profesional Universitario (Prov)","PROFESIONAL",2044,"07"]
[null,null,null,null,null,null,null,null,null,null,null,null,null,null,null,"2017-05-12",null,null,null,null,null,null,null,null,null,null,50.699999999999903,"NO SATISFACTORIO",null,null,null,null,null,null,null,null,null,null,null,null,null,null,null,null,null,null,null,null,null,null,null,null,19204719,"SÁNCHEZ","INFANTE","LUIS","EDUARDO","Despacho del Superintendente Delegado para la Protección del Consumidor","","Despacho del Superintendente Delegado para la Protección del Consumidor ","Conductor Mecánico (Prov)","ASISTENCIAL",4103,"09"]
[null,null,null,null,null,null,null,null,null,null,null,null,null,null,null,"2017-05-13",null,null,null,null,null,null,null,null,null,null,50.799999999999898,"NO SATISFACTORIO",null,null,null,null,null,null,null,null,null,null,null,null,null,null,null,null,null,null,null,null,null,null,null,null,1022951438,"SÁNCHEZ","LÓPEZ","ROBERTO","ANDRÉS","Dirección de Investigaciones para el Control y Verificación de Reglamentos Técnicos y Metrología Legal","-Grupo de Trabajo de Inspección y Vigilancia de Reglamentos Técnicos","Dirección de Investigaciones para el Control y Verificación de Reglamentos Técnicos y Metrología Legal -Grupo de Trabajo de Inspección y Vigilancia de Reglamentos Técnicos","Profesional Universitario (Prov)","PROFESIONAL",2044,"01"]
[null,null,null,null,null,null,null,null,null,null,null,null,null,null,null,"2017-05-14",null,null,null,null,null,null,null,null,null,null,50.899999999999899,"NO SATISFACTORIO",null,null,null,null,null,null,null,null,null,null,null,null,null,null,null,null,null,null,null,null,null,null,null,null,79942242,"SÁNCHEZ","MEDINA","JORGE","ENRIQUE","Despacho del Superintendente Delegado para la Protección de la Competencia","","Despacho del Superintendente Delegado para la Protección de la Competencia ","Superintendente Delegado","DIRECTIVO","0110",19]
[null,null,null,null,null,null,null,null,null,null,null,null,null,null,null,"2017-05-15",null,null,null,null,null,null,null,null,null,null,50.999999999999901,"NO SATISFACTORIO",null,null,null,null,null,null,null,null,null,null,null,null,null,null,null,null,null,null,null,null,null,null,null,null,39762096,"SÁNCHEZ","MERCHÁN","SANDRA","PATRICIA","Secretaría General","- Grupo de Trabajo de Notificaciones y Certificaciones","Secretaría General - Grupo de Trabajo de Notificaciones y Certificaciones","Técnico Administrativo (Prov)","TECNICO",3124,"07"]
[null,null,null,null,null,null,null,null,null,null,null,null,null,null,null,"2017-05-16",null,null,null,null,null,null,null,null,null,null,51.099999999999902,"NO SATISFACTORIO",null,null,null,null,null,null,null,null,null,null,null,null,null,null,null,null,null,null,null,null,null,null,null,null,52410848,"SÁNCHEZ","PEREA","CAROLINA"," -","Dirección de Signos Distintivos","- Grupo de Trabajo de Forma","Dirección de Signos Distintivos - Grupo de Trabajo de Forma","Profesional Universitario (Prov)","PROFESIONAL",2044,"05"]
[null,null,null,null,null,null,null,null,null,null,null,null,null,null,null,"2017-05-17",null,null,null,null,null,null,null,null,null,null,51.199999999999903,"NO SATISFACTORIO",null,null,null,null,null,null,null,null,null,null,null,null,null,null,null,null,null,null,null,null,null,null,null,null,1032383050,"SÁNCHEZ","PITTA","DIANA","PAOLA","Despacho del Superintendente Delegado para Asuntos Jurisdiccionales","- Grupo de Trabajo de Calificación","Despacho del Superintendente Delegado para Asuntos Jurisdiccionales - Grupo de Trabajo de Calificación","Profesional Universitario (Prov)","PROFESIONAL",2044,"03"]
[null,null,null,null,null,null,null,null,null,null,null,null,null,null,null,"2017-05-18",null,null,null,null,null,null,null,null,null,null,51.299999999999898,"NO SATISFACTORIO",null,null,null,null,null,null,null,null,null,null,null,null,null,null,null,null,null,null,null,null,null,null,null,null,79827738,"SÁNCHEZ","QUIÑONES","JUAN","ALBERTO","Dirección Administrativa","- Grupo de Trabajo de Gestión Documental y Recursos Físicos","Dirección Administrativa - Grupo de Trabajo de Gestión Documental y Recursos Físicos","Operario Calificado  (Prov)","ASISTENCIAL",4169,"09"]
[null,null,null,null,null,null,null,null,null,null,null,null,null,null,null,"2017-05-19",null,null,null,null,null,null,null,null,null,null,51.399999999999899,"NO SATISFACTORIO",null,null,null,null,null,null,null,null,null,null,null,null,null,null,null,null,null,null,null,null,null,null,null,null,51799522,"SÁNCHEZ","SOSSA","MARTHA","CELMIRA","Despacho del Superintendente Delegado para la Protección de la Competencia","- Grupo de Trabajo de Integraciones Empresariales","Despacho del Superintendente Delegado para la Protección de la Competencia - Grupo de Trabajo de Integraciones Empresariales","Profesional Especializado (Prov)","PROFESIONAL",2028,13]
[null,null,null,null,null,null,null,null,null,null,null,null,null,null,null,"2017-05-20",null,null,null,null,null,null,null,null,null,null,51.499999999999901,"NO SATISFACTORIO",null,null,null,null,null,null,null,null,null,null,null,null,null,null,null,null,null,null,null,null,null,null,null,null,1019033449,"SÁNCHEZ","TORRES","KAREN","NATALIA","Dirección de Investigaciones de Protección al Consumidor",null,"Dirección de Investigaciones de Protección al Consumidor ","Profesional Universitario (Prov)","PROFESIONAL",2044,"05"]
[null,null,null,null,null,null,null,null,null,null,null,null,null,null,null,"2017-05-21",null,null,null,null,null,null,null,null,null,null,51.599999999999902,"NO SATISFACTORIO",null,null,null,null,null,null,null,null,null,null,null,null,null,null,null,null,null,null,null,null,null,null,null,null,1098606455,"SANDOVAL","GUTIÉRREZ","JOSÉ","FERNANDO","Despacho del Superintendente Delegado para Asuntos Jurisdiccionales","- Grupo de Trabajo de Competencia Desleal y Propiedad Industrial","Despacho del Superintendente Delegado para Asuntos Jurisdiccionales - Grupo de Trabajo de Competencia Desleal y Propiedad Industrial","Profesional Especializado (Prov)","PROFESIONAL",2028,13]
[null,null,null,null,null,null,null,null,null,null,null,null,null,null,null,"2017-05-22",null,null,null,null,null,null,null,null,null,null,51.699999999999903,"NO SATISFACTORIO",null,null,null,null,null,null,null,null,null,null,null,null,null,null,null,null,null,null,null,null,null,null,null,null,39754784,"SANDOVAL","PINZÓN","SONIA","SUSANA","Despacho del Superintendente Delegado para Asuntos Jurisdiccionales","- Grupo de Trabajo de Secretaría","Despacho del Superintendente Delegado para Asuntos Jurisdiccionales - Grupo de Trabajo de Secretaría","Secretario (Prov)","ASISTENCIAL",4178,10]
[null,null,null,null,null,null,null,null,null,null,null,null,null,null,null,"2017-05-23",null,null,null,null,null,null,null,null,null,null,51.799999999999898,"NO SATISFACTORIO",null,null,null,null,null,null,null,null,null,null,null,null,null,null,null,null,null,null,null,null,null,null,null,null,53046895,"SARMIENTO","MÉNDEZ","LEIDY","JOHANNA","Dirección Administrativa","- Grupo de Trabajo de Gestión Documental y Recursos Físicos","Dirección Administrativa - Grupo de Trabajo de Gestión Documental y Recursos Físicos","Técnico Administrativo (Prov)","TECNICO",3124,"07"]
[null,null,null,null,null,null,null,null,null,null,null,null,null,null,null,"2017-05-24",null,null,null,null,null,null,null,null,null,null,51.8999999999998,"NO SATISFACTORIO",null,null,null,null,null,null,null,null,null,null,null,null,null,null,null,null,null,null,null,null,null,null,null,null,3242433,"SEGURA","GARZÓN","MARTIN","ROMAN","Despacho del Superintendente Delegado para la Protección de la Competencia","- Grupo de Trabajo de Integraciones Empresariales","Despacho del Superintendente Delegado para la Protección de la Competencia - Grupo de Trabajo de Integraciones Empresariales","Profesional Especializado (E)","PROFESIONAL",2028,13]
[null,null,null,null,null,null,null,null,null,null,null,null,null,null,null,"2017-05-25",null,null,null,null,null,null,null,null,null,null,51.999999999999901,"NO SATISFACTORIO",null,null,null,null,null,null,null,null,null,null,null,null,null,null,null,null,null,null,null,null,null,null,null,null,52021907,"SERNA","ROMERO","MARÍA","DEL PILAR","Despacho del Superintendente Delegado para Asuntos Jurisdiccionales","- Grupo de Trabajo de Defensa del Consumidor","Despacho del Superintendente Delegado para Asuntos Jurisdiccionales - Grupo de Trabajo de Defensa del Consumidor","Profesional Especializado (E)","PROFESIONAL",2028,13]
[null,null,null,null,null,null,null,null,null,null,null,null,null,null,null,"2017-05-26",null,null,null,null,null,null,null,null,null,null,52.099999999999902,"NO SATISFACTORIO",null,null,null,null,null,null,null,null,null,null,null,null,null,null,null,null,null,null,null,null,null,null,null,null,79875670,"SERRANO","CASTILLO","JUAN","MANUEL","Dirección de Signos Distintivos","- Grupo de Trabajo de Oposiciones y Cancelaciones","Dirección de Signos Distintivos - Grupo de Trabajo de Oposiciones y Cancelaciones","Profesional Universitario (Prov)","PROFESIONAL",2044,11]
[null,null,null,null,null,null,null,null,null,null,null,null,null,null,null,"2017-05-27",null,null,null,null,null,null,null,null,null,null,52.199999999999903,"NO SATISFACTORIO",null,null,null,null,null,null,null,null,null,null,null,null,null,null,null,null,null,null,null,null,null,null,null,null,52864242,"SERRANO","GONZÁLEZ","SUSY","LORENA","Oficina Asesora de Planeación","- Grupo de Trabajo de Asuntos Internacionales","Oficina Asesora de Planeación - Grupo de Trabajo de Asuntos Internacionales","Profesional Universitario (Prov)","PROFESIONAL",2044,"09"]
[null,null,null,null,null,null,null,null,null,null,null,null,null,null,null,"2017-05-28",null,null,null,null,null,null,null,null,null,null,52.299999999999898,"NO SATISFACTORIO",null,null,null,null,null,null,null,null,null,null,null,null,null,null,null,null,null,null,null,null,null,null,null,null,1032363486,"SIERRA","MONSALVE","XIMENA"," -","Despacho del Superintendente Delegado para Asuntos Jurisdiccionales","- Grupo de Trabajo para la Verificación del Cumplimiento","Despacho del Superintendente Delegado para Asuntos Jurisdiccionales - Grupo de Trabajo para la Verificación del Cumplimiento","Profesional Universitario (Prov)","PROFESIONAL",2044,"01"]
[null,null,null,null,null,null,null,null,null,null,null,null,null,null,null,"2017-05-29",null,null,null,null,null,null,null,null,null,null,52.3999999999998,"NO SATISFACTORIO",null,null,null,null,null,null,null,null,null,null,null,null,null,null,null,null,null,null,null,null,null,null,null,null,1032396709,"SIERRA","NIÑO","GISELA","VIVIANA","Secretaría General","- Grupo de Trabajo de Talento Humano",{"$f":"CONCATENATE(BF515,\" \",BG515)","v":"Secretaría General - Grupo de Trabajo de Talento Humano"},"Auxiliar Administrativo (Prov)","ASISTENCIAL",4044,"09"]
[null,null,null,null,null,null,null,null,null,null,null,null,null,null,null,"2017-05-30",null,null,null,null,null,null,null,null,null,null,52.499999999999901,"NO SATISFACTORIO",null,null,null,null,null,null,null,null,null,null,null,null,null,null,null,null,null,null,null,null,null,null,null,null,93356408,"SILVA","MARTÍNEZ","CAMILO"," -","Dirección Administrativa","- Grupo de Trabajo de Gestión Documental y Recursos Físicos","Dirección Administrativa - Grupo de Trabajo de Gestión Documental y Recursos Físicos","Auxiliar Administrativo (E)","ASISTENCIAL",4044,11]
[null,null,null,null,null,null,null,null,null,null,null,null,null,null,null,"2017-05-31",null,null,null,null,null,null,null,null,null,null,52.599999999999902,"NO SATISFACTORIO",null,null,null,null,null,null,null,null,null,null,null,null,null,null,null,null,null,null,null,null,null,null,null,null,14320276,"SILVA","RUBIO","LUIS","ANTONIO","Despacho del Superintendente Delegado para la Propiedad Industrial","- Grupo de Trabajo de Centro de Información Tecnológica y Apoyo a la Gestión de la Propiedad Industrial","Despacho del Superintendente Delegado para la Propiedad Industrial - Grupo de Trabajo de Centro de Información Tecnológica y Apoyo a la Gestión de la Propiedad Industrial","Profesional Especializado (Prov)","PROFESIONAL",2028,13]
[null,null,null,null,null,null,null,null,null,null,null,null,null,null,null,"2017-06-01",null,null,null,null,null,null,null,null,null,null,52.699999999999797,"NO SATISFACTORIO",null,null,null,null,null,null,null,null,null,null,null,null,null,null,null,null,null,null,null,null,null,null,null,null,52081980,"SOACHA","PEDRAZA","JAZMÍN","ROCÍO","Oficina Asesora Jurídica",null,"Oficina Asesora Jurídica ","Jefe de Oficina Asesora de Jurídica ( C)","ASESOR",1045,"09"]
[null,null,null,null,null,null,null,null,null,null,null,null,null,null,null,"2017-06-02",null,null,null,null,null,null,null,null,null,null,52.799999999999798,"NO SATISFACTORIO",null,null,null,null,null,null,null,null,null,null,null,null,null,null,null,null,null,null,null,null,null,null,null,null,37949231,"SOLANO","ESPINOSA","ANA","MARÍA","Despacho del Superintendente Delegado para Asuntos Jurisdiccionales","- Grupo de Trabajo de Calificación","Despacho del Superintendente Delegado para Asuntos Jurisdiccionales - Grupo de Trabajo de Calificación","Profesional Universitario (Prov)","PROFESIONAL",2044,11]
[null,null,null,null,null,null,null,null,null,null,null,null,null,null,null,"2017-06-03",null,null,null,null,null,null,null,null,null,null,52.8999999999998,"NO SATISFACTORIO",null,null,null,null,null,null,null,null,null,null,null,null,null,null,null,null,null,null,null,null,null,null,null,null,79154267,"SOSA","CETINA","MANUEL","FERNANDO","Dirección Administrativa","- Grupo de Trabajo de Gestión Documental y Recursos Físicos","Dirección Administrativa - Grupo de Trabajo de Gestión Documental y Recursos Físicos","Auxiliar Administrativo (Prov)","ASISTENCIAL",4044,11]
[null,null,null,null,null,null,null,null,null,null,null,null,null,null,null,"2017-06-04",null,null,null,null,null,null,null,null,null,null,52.999999999999901,"NO SATISFACTORIO",null,null,null,null,null,null,null,null,null,null,null,null,null,null,null,null,null,null,null,null,null,null,null,null,79951539,"SOTELO","CASTELBLANCO","MAURY","FERNANDO","Despacho del Superintendente Delegado para Asuntos Jurisdiccionales","- Grupo de Trabajo de Competencia Desleal y Propiedad Industrial","Despacho del Superintendente Delegado para Asuntos Jurisdiccionales - Grupo de Trabajo de Competencia Desleal y Propiedad Industrial","Profesional Universitario (Prov)","PROFESIONAL",2044,10]
[null,null,null,null,null,null,null,null,null,null,null,null,null,null,null,"2017-06-05",null,null,null,null,null,null,null,null,null,null,53.099999999999902,"NO SATISFACTORIO",null,null,null,null,null,null,null,null,null,null,null,null,null,null,null,null,null,null,null,null,null,null,null,null,80758766,"SOTO","CELIS","JOSÉ","ROBERTO","Dirección de Investigaciones de Protección de Usuarios de Servicios de Comunicaciones","- Grupo de Trabajo de Supervisión, Control y Vigilancia de los Regímenes de Protección de Usuarios de Servicios de Comunicaciones","Dirección de Investigaciones de Protección de Usuarios de Servicios de Comunicaciones - Grupo de Trabajo de Supervisión, Control y Vigilancia de los Regímenes de Protección de Usuarios de Servicios de Comunicaciones","Profesional Universitario (Prov)","PROFESIONAL",2044,"09"]
[null,null,null,null,null,null,null,null,null,null,null,null,null,null,null,"2017-06-06",null,null,null,null,null,null,null,null,null,null,53.199999999999797,"NO SATISFACTORIO",null,null,null,null,null,null,null,null,null,null,null,null,null,null,null,null,null,null,null,null,null,null,null,null,1014184314,"SUÁREZ","ARDILA","KATHERINE"," -","Oficina de Tecnología e Informática","- Grupo de Trabajo de Gestión de Información y Proyectos Informáticos","Oficina de Tecnología e Informática - Grupo de Trabajo de Gestión de Información y Proyectos Informáticos","Profesional Universitario (Prov)","PROFESIONAL",2044,"09"]
[null,null,null,null,null,null,null,null,null,null,null,null,null,null,null,"2017-06-07",null,null,null,null,null,null,null,null,null,null,53.299999999999798,"NO SATISFACTORIO",null,null,null,null,null,null,null,null,null,null,null,null,null,null,null,null,null,null,null,null,null,null,null,null,52517699,"SUSA","CRUZ","OLGA","PATRICIA","Oficina Asesora Jurídica","- Grupo de Trabajo de Regulación","Oficina Asesora Jurídica - Grupo de Trabajo de Regulación","Profesional Especializado (Prov)","PROFESIONAL",2028,13]
[null,null,null,null,null,null,null,null,null,null,null,null,null,null,null,"2017-06-08",null,null,null,null,null,null,null,null,null,null,53.3999999999998,"NO SATISFACTORIO",null,null,null,null,null,null,null,null,null,null,null,null,null,null,null,null,null,null,null,null,null,null,null,null,1010183203,"TAMAYO","RIVERA","SERGIO","ANDRÉS","Despacho del Superintendente Delegado para la Protección de la Competencia","- Grupo de Trabajo de Protección y Promoción de la Competencia","Despacho del Superintendente Delegado para la Protección de la Competencia - Grupo de Trabajo de Protección y Promoción de la Competencia","Profesional Universitario (Prov)","PROFESIONAL",2044,"03"]
[null,null,null,null,null,null,null,null,null,null,null,null,null,null,null,"2017-06-09",null,null,null,null,null,null,null,null,null,null,53.499999999999801,"NO SATISFACTORIO",null,null,null,null,null,null,null,null,null,null,null,null,null,null,null,null,null,null,null,null,null,null,null,null,1100393339,"TEHERAN","BENAVIDES","VICTOR","LORENZO","Dirección de Investigaciones de Protección de Usuarios de Servicios de Comunicaciones","- Grupo de Trabajo de Investigaciones Administrativas de Protección de Usuarios de Servicios de Comunicaciones","Dirección de Investigaciones de Protección de Usuarios de Servicios de Comunicaciones - Grupo de Trabajo de Investigaciones Administrativas de Protección de Usuarios de Servicios de Comunicaciones","Profesional Universitario (Prov)","PROFESIONAL",2044,"03"]
[null,null,null,null,null,null,null,null,null,null,null,null,null,null,null,"2017-06-10",null,null,null,null,null,null,null,null,null,null,53.599999999999802,"NO SATISFACTORIO",null,null,null,null,null,null,null,null,null,null,null,null,null,null,null,null,null,null,null,null,null,null,null,null,52388299,"TÉLLEZ","CHAVARRO","ROSA","PATRICIA","Dirección de Nuevas Creaciones","- Grupo de Trabajo del Sector de Ingenierías","Dirección de Nuevas Creaciones - Grupo de Trabajo del Sector de Ingenierías","Profesional Universitario (Prov)","PROFESIONAL",2044,10]
[null,null,null,null,null,null,null,null,null,null,null,null,null,null,null,"2017-06-11",null,null,null,null,null,null,null,null,null,null,53.699999999999797,"NO SATISFACTORIO",null,null,null,null,null,null,null,null,null,null,null,null,null,null,null,null,null,null,null,null,null,null,null,null,80048162,"TÉLLEZ","JIMÉNEZ","OMAR","JAVIER","Dirección de Cámaras de Comercio","- Grupo de Trabajo de Trámites Administrativos","Dirección de Cámaras de Comercio - Grupo de Trabajo de Trámites Administrativos","Técnico Administrativo (Prov)","TECNICO",3124,"09"]
[null,null,null,null,null,null,null,null,null,null,null,null,null,null,null,"2017-06-12",null,null,null,null,null,null,null,null,null,null,53.799999999999798,"NO SATISFACTORIO",null,null,null,null,null,null,null,null,null,null,null,null,null,null,null,null,null,null,null,null,null,null,null,null,1010171903,"TINOCO","JIMÉNEZ","SEBASTIAN"," -","Despacho del Superintendente Delegado para Asuntos Jurisdiccionales","- Grupo de Trabajo de Calificación","Despacho del Superintendente Delegado para Asuntos Jurisdiccionales - Grupo de Trabajo de Calificación","Profesional Universitario (Prov)","PROFESIONAL",2044,"03"]
[null,null,null,null,null,null,null,null,null,null,null,null,null,null,null,"2017-06-13",null,null,null,null,null,null,null,null,null,null,53.8999999999998,"NO SATISFACTORIO",null,null,null,null,null,null,null,null,null,null,null,null,null,null,null,null,null,null,null,null,null,null,null,null,1019026053,"TOBAR","ZARATE","CAROLINA"," -","Despacho del Superintendente Delegado para la Propiedad Industrial","- Grupo de Trabajo de Vía Gubernativa","Despacho del Superintendente Delegado para la Propiedad Industrial - Grupo de Trabajo de Vía Gubernativa","Profesional Universitario (Prov)","PROFESIONAL",2044,"03"]
[null,null,null,null,null,null,null,null,null,null,null,null,null,null,null,"2017-06-14",null,null,null,null,null,null,null,null,null,null,53.999999999999801,"NO SATISFACTORIO",null,null,null,null,null,null,null,null,null,null,null,null,null,null,null,null,null,null,null,null,null,null,null,null,74376629,"TOLOSA","SOLANO","JAIME","NEVARDO","Despacho del Superintendente Delegado para la Protección de la Competencia","- Grupo de Trabajo de Integraciones Empresariales","Despacho del Superintendente Delegado para la Protección de la Competencia - Grupo de Trabajo de Integraciones Empresariales","Profesional Universitario (Prov)","PROFESIONAL",2044,"09"]
[null,null,null,null,null,null,null,null,null,null,null,null,null,null,null,"2017-06-15",null,null,null,null,null,null,null,null,null,null,54.099999999999802,"NO SATISFACTORIO",null,null,null,null,null,null,null,null,null,null,null,null,null,null,null,null,null,null,null,null,null,null,null,null,42068162,"TORO","ARANGO","MARIELA"," -","Oficina de Servicios al Consumidor y de Apoyo Empresarial","- Grupo de Trabajo de Atención al Ciudadano","Oficina de Servicios al Consumidor y de Apoyo Empresarial - Grupo de Trabajo de Atención al Ciudadano","Auxiliar Administrativo (Prov)","ASISTENCIAL",4044,"09"]
[null,null,null,null,null,null,null,null,null,null,null,null,null,null,null,"2017-06-16",null,null,null,null,null,null,null,null,null,null,54.199999999999797,"NO SATISFACTORIO",null,null,null,null,null,null,null,null,null,null,null,null,null,null,null,null,null,null,null,null,null,null,null,null,80240346,"TORREGROSA","REBOLLEDO","GREGORY","DE JESÚS","Despacho del Superintendente",null,"Despacho del Superintendente ","Asesor","ASESOR",1020,12]
[null,null,null,null,null,null,null,null,null,null,null,null,null,null,null,"2017-06-17",null,null,null,null,null,null,null,null,null,null,54.299999999999798,"NO SATISFACTORIO",null,null,null,null,null,null,null,null,null,null,null,null,null,null,null,null,null,null,null,null,null,null,null,null,72052213,"TORREGROZA","CERVERA","HENRY","DAVID","Despacho del Superintendente Delegado para Asuntos Jurisdiccionales","- Grupo de Trabajo de Defensa del Consumidor","Despacho del Superintendente Delegado para Asuntos Jurisdiccionales - Grupo de Trabajo de Defensa del Consumidor","Profesional Universitario (Prov)","PROFESIONAL",2044,"01"]
[null,null,null,null,null,null,null,null,null,null,null,null,null,null,null,"2017-06-18",null,null,null,null,null,null,null,null,null,null,54.3999999999998,"NO SATISFACTORIO",null,null,null,null,null,null,null,null,null,null,null,null,null,null,null,null,null,null,null,null,null,null,null,null,52417670,"TORRES","CAMARGO","HELGA","JOHANNA","Dirección de Investigaciones de Protección al Consumidor","","Dirección de Investigaciones de Protección al Consumidor ","Profesional Universitario (Prov)","PROFESIONAL",2044,11]
[null,null,null,null,null,null,null,null,null,null,null,null,null,null,null,"2017-06-19",null,null,null,null,null,null,null,null,null,null,54.499999999999801,"NO SATISFACTORIO",null,null,null,null,null,null,null,null,null,null,null,null,null,null,null,null,null,null,null,null,null,null,null,null,52968347,"TORRES","PRADA","IVONNE","MARIANA","Dirección Administrativa","- Grupo de Trabajo de Gestión Documental y Recursos Físicos","Dirección Administrativa - Grupo de Trabajo de Gestión Documental y Recursos Físicos","Profesional Universitario (Prov)","PROFESIONAL",2044,"05"]
[null,null,null,null,null,null,null,null,null,null,null,null,null,null,null,"2017-06-20",null,null,null,null,null,null,null,null,null,null,54.599999999999802,"NO SATISFACTORIO",null,null,null,null,null,null,null,null,null,null,null,null,null,null,null,null,null,null,null,null,null,null,null,null,51746745,"TORRES","TORRES","SOL"," -","Dirección de Investigaciones para el Control y Verificación de Reglamentos Técnicos y Metrología Legal","-Grupo de Trabajo de Inspección y Vigilancia de Reglamentos Técnicos","Dirección de Investigaciones para el Control y Verificación de Reglamentos Técnicos y Metrología Legal -Grupo de Trabajo de Inspección y Vigilancia de Reglamentos Técnicos","Profesional Universitario (E)","PROFESIONAL",2044,"09"]
[null,null,null,null,null,null,null,null,null,null,null,null,null,null,null,"2017-06-21",null,null,null,null,null,null,null,null,null,null,54.699999999999797,"NO SATISFACTORIO",null,null,null,null,null,null,null,null,null,null,null,null,null,null,null,null,null,null,null,null,null,null,null,null,52106356,"TOVAR","GUERRERO","SANDRA","ELIZABETH","Dirección Financiera",null,"Dirección Financiera ","Profesional Universitario (E)","PROFESIONAL",2044,"05"]
[null,null,null,null,null,null,null,null,null,null,null,null,null,null,null,"2017-06-22",null,null,null,null,null,null,null,null,null,null,54.799999999999798,"NO SATISFACTORIO",null,null,null,null,null,null,null,null,null,null,null,null,null,null,null,null,null,null,null,null,null,null,null,null,39019107,"TREN","BENAVIDES","NANCY"," -","Dirección Administrativa","- Grupo de Trabajo de Gestión Documental y Recursos Físicos","Dirección Administrativa - Grupo de Trabajo de Gestión Documental y Recursos Físicos","Auxiliar Administrativo (Prov)","ASISTENCIAL",4044,"08"]
[null,null,null,null,null,null,null,null,null,null,null,null,null,null,null,"2017-06-23",null,null,null,null,null,null,null,null,null,null,54.8999999999998,"NO SATISFACTORIO",null,null,null,null,null,null,null,null,null,null,null,null,null,null,null,null,null,null,null,null,null,null,null,null,32709460,"TRIANA","GUTIÉRREZ","EMILSE","ISABEL","Secretaría General","- Grupo de Trabajo de Talento Humano","Secretaría General - Grupo de Trabajo de Talento Humano","Profesional Universitario (Prov)","PROFESIONAL",2044,"03"]
[null,null,null,null,null,null,null,null,null,null,null,null,null,null,null,"2017-06-24",null,null,null,null,null,null,null,null,null,null,54.999999999999801,"NO SATISFACTORIO",null,null,null,null,null,null,null,null,null,null,null,null,null,null,null,null,null,null,null,null,null,null,null,null,80061368,"TRIVIÑO","CALDERÓN","CARLOS","AUGUSTO","Despacho del Superintendente Delegado para Asuntos Jurisdiccionales","- Grupo de Trabajo de Defensa del Consumidor","Despacho del Superintendente Delegado para Asuntos Jurisdiccionales - Grupo de Trabajo de Defensa del Consumidor","Profesional Universitario (Prov)","PROFESIONAL",2044,"05"]
[null,null,null,null,null,null,null,null,null,null,null,null,null,null,null,"2017-06-25",null,null,null,null,null,null,null,null,null,null,55.099999999999802,"NO SATISFACTORIO",null,null,null,null,null,null,null,null,null,null,null,null,null,null,null,null,null,null,null,null,null,null,null,null,1090407073,"TURBAY","VELANDIA","GABRIEL"," -","Oficina Asesora Jurídica",null,"Oficina Asesora Jurídica ","Profesional Universitario (Prov)","PROFESIONAL",2044,"05"]
[null,null,null,null,null,null,null,null,null,null,null,null,null,null,null,"2017-06-26",null,null,null,null,null,null,null,null,null,null,55.199999999999797,"NO SATISFACTORIO",null,null,null,null,null,null,null,null,null,null,null,null,null,null,null,null,null,null,null,null,null,null,null,null,35491995,"TUSO","MATALLANA","CLEMENCIA"," -","Despacho del Superintendente Delegado para la Propiedad Industrial","- Grupo de Trabajo de Centro de Información Tecnológica y Apoyo a la Gestión de la Propiedad Industrial","Despacho del Superintendente Delegado para la Propiedad Industrial - Grupo de Trabajo de Centro de Información Tecnológica y Apoyo a la Gestión de la Propiedad Industrial","Técnico Administrativo (E)","TECNICO",3124,11]
[null,null,null,null,null,null,null,null,null,null,null,null,null,null,null,"2017-06-27",null,null,null,null,null,null,null,null,null,null,55.299999999999798,"NO SATISFACTORIO",null,null,null,null,null,null,null,null,null,null,null,null,null,null,null,null,null,null,null,null,null,null,null,null,41782643,"ULLOA","DE","LUZ","MARINA","Secretaría General","- Grupo de Trabajo de Talento Humano","Secretaría General - Grupo de Trabajo de Talento Humano","Profesional Universitario (E)","PROFESIONAL",2044,11]
[null,null,null,null,null,null,null,null,null,null,null,null,null,null,null,"2017-06-28",null,null,null,null,null,null,null,null,null,null,55.3999999999998,"NO SATISFACTORIO",null,null,null,null,null,null,null,null,null,null,null,null,null,null,null,null,null,null,null,null,null,null,null,null,52420640,"URIBE","NAVARRO","ANA","MARÍA","Oficina de Servicios al Consumidor y de Apoyo Empresarial","","Oficina de Servicios al Consumidor y de Apoyo Empresarial ","Jefe de Oficina ","DIRECTIVO","0137",16]
[null,null,null,null,null,null,null,null,null,null,null,null,null,null,null,"2017-06-29",null,null,null,null,null,null,null,null,null,null,55.499999999999801,"NO SATISFACTORIO",null,null,null,null,null,null,null,null,null,null,null,null,null,null,null,null,null,null,null,null,null,null,null,null,1026576426,"USMA","LEÓN","YESICA","ANDREA","Oficina Asesora Jurídica","- Grupo de Trabajo de Regulación","Oficina Asesora Jurídica - Grupo de Trabajo de Regulación","Auxiliar Administrativo (Prov)","ASISTENCIAL",4044,"08"]
[null,null,null,null,null,null,null,null,null,null,null,null,null,null,null,"2017-06-30",null,null,null,null,null,null,null,null,null,null,55.599999999999802,"NO SATISFACTORIO",null,null,null,null,null,null,null,null,null,null,null,null,null,null,null,null,null,null,null,null,null,null,null,null,46362131,"USSA","RINCÓN","JULIA","MARÍA","Dirección de Cámaras de Comercio","- Grupo de Trabajo de Trámites Administrativos","Dirección de Cámaras de Comercio - Grupo de Trabajo de Trámites Administrativos","Profesional Universitario (Prov)","PROFESIONAL",2044,"09"]
[null,null,null,null,null,null,null,null,null,null,null,null,null,null,null,"2017-07-01",null,null,null,null,null,null,null,null,null,null,55.699999999999797,"NO SATISFACTORIO",null,null,null,null,null,null,null,null,null,null,null,null,null,null,null,null,null,null,null,null,null,null,null,null,51883392,"VALBUENA","JARAMILLO","MÓNICA"," -","Dirección Financiera",null,"Dirección Financiera ","Técnico Administrativo (Prov)","TECNICO",3124,11]
[null,null,null,null,null,null,null,null,null,null,null,null,null,null,null,"2017-07-02",null,null,null,null,null,null,null,null,null,null,55.799999999999798,"NO SATISFACTORIO",null,null,null,null,null,null,null,null,null,null,null,null,null,null,null,null,null,null,null,null,null,null,null,null,79553883,"VALDÉS","ZAMBRANO","SERGIO","RICARDO","Oficina de Tecnología e Informática","- Grupo de Trabajo de Infraestructura Tecnológica y Seguridad","Oficina de Tecnología e Informática - Grupo de Trabajo de Infraestructura Tecnológica y Seguridad","Profesional Universitario (Prov)","PROFESIONAL",2044,"03"]
[null,null,null,null,null,null,null,null,null,null,null,null,null,null,null,"2017-07-03",null,null,null,null,null,null,null,null,null,null,55.8999999999998,"NO SATISFACTORIO",null,null,null,null,null,null,null,null,null,null,null,null,null,null,null,null,null,null,null,null,null,null,null,null,37009306,"VALLEJO","ARTEAGA","MARÍA","CRISTINA","Despacho del Superintendente Delegado para Asuntos Jurisdiccionales","- Grupo de Trabajo de Defensa del Consumidor","Despacho del Superintendente Delegado para Asuntos Jurisdiccionales - Grupo de Trabajo de Defensa del Consumidor","Profesional Universitario (Prov)","PROFESIONAL",2044,"09"]
[null,null,null,null,null,null,null,null,null,null,null,null,null,null,null,"2017-07-04",null,null,null,null,null,null,null,null,null,null,55.999999999999801,"NO SATISFACTORIO",null,null,null,null,null,null,null,null,null,null,null,null,null,null,null,null,null,null,null,null,null,null,null,null,1144048884,"VARELA","MARTÍNEZ","MATEO"," -","Oficina Asesora de Planeación","- Grupo de Trabajo de Asuntos Internacionales","Oficina Asesora de Planeación - Grupo de Trabajo de Asuntos Internacionales","Profesional Universitario (Prov)","PROFESIONAL",2044,"03"]
[null,null,null,null,null,null,null,null,null,null,null,null,null,null,null,"2017-07-05",null,null,null,null,null,null,null,null,null,null,56.099999999999802,"NO SATISFACTORIO",null,null,null,null,null,null,null,null,null,null,null,null,null,null,null,null,null,null,null,null,null,null,null,null,80063316,"VARGAS","LÓPEZ","PEDRO","JOSÈ","Dirección de Investigaciones para el Control y Verificación de Reglamentos Técnicos y Metrología Legal","- Grupo de Trabajo de Inspección y Vigilancia de Metrología Legal","Dirección de Investigaciones para el Control y Verificación de Reglamentos Técnicos y Metrología Legal - Grupo de Trabajo de Inspección y Vigilancia de Metrología Legal","Auxiliar Administrativo (Prov)","ASISTENCIAL",4044,11]
[null,null,null,null,null,null,null,null,null,null,null,null,null,null,null,"2017-07-06",null,null,null,null,null,null,null,null,null,null,56.199999999999797,"NO SATISFACTORIO",null,null,null,null,null,null,null,null,null,null,null,null,null,null,null,null,null,null,null,null,null,null,null,null,1126905742,"VARGAS","REYES","VANESSA"," -","Despacho del Superintendente Delegado para Asuntos Jurisdiccionales","- Grupo de Trabajo de Competencia Desleal y Propiedad Industrial","Despacho del Superintendente Delegado para Asuntos Jurisdiccionales - Grupo de Trabajo de Competencia Desleal y Propiedad Industrial","Auxiliar Administrativo (Prov)","ASISTENCIAL",4044,"09"]
[null,null,null,null,null,null,null,null,null,null,null,null,null,null,null,"2017-07-07",null,null,null,null,null,null,null,null,null,null,56.299999999999798,"NO SATISFACTORIO",null,null,null,null,null,null,null,null,null,null,null,null,null,null,null,null,null,null,null,null,null,null,null,null,1020748244,"VARGAS","RIVERA","TATIANA"," -","Dirección de Nuevas Creaciones","- Grupo de Trabajo de Ciencias Farmacéuticas y Biológicas","Dirección de Nuevas Creaciones - Grupo de Trabajo de Ciencias Farmacéuticas y Biológicas","Profesional Universitario (Prov)","PROFESIONAL",2044,"01"]
[null,null,null,null,null,null,null,null,null,null,null,null,null,null,null,"2017-07-08",null,null,null,null,null,null,null,null,null,null,56.3999999999998,"NO SATISFACTORIO",null,null,null,null,null,null,null,null,null,null,null,null,null,null,null,null,null,null,null,null,null,null,null,null,79793580,"VARGAS","SALAZAR","VLADIMIR","ROLANDO","Despacho del Superintendente Delegado para Asuntos Jurisdiccionales","- Grupo de Trabajo de Competencia Desleal y Propiedad Industrial","Despacho del Superintendente Delegado para Asuntos Jurisdiccionales - Grupo de Trabajo de Competencia Desleal y Propiedad Industrial","Profesional Universitario (Prov)","PROFESIONAL",2044,"03"]
[null,null,null,null,null,null,null,null,null,null,null,null,null,null,null,"2017-07-09",null,null,null,null,null,null,null,null,null,null,56.499999999999801,"NO SATISFACTORIO",null,null,null,null,null,null,null,null,null,null,null,null,null,null,null,null,null,null,null,null,null,null,null,null,1061710628,"VARONA","GUZMAN","ANA","ISABEL","Dirección de Signos Distintivos",null,"Dirección de Signos Distintivos ","Profesional Universitario (Prov)","PROFESIONAL",2044,"09"]
[null,null,null,null,null,null,null,null,null,null,null,null,null,null,null,"2017-07-10",null,null,null,null,null,null,null,null,null,null,56.599999999999802,"NO SATISFACTORIO",null,null,null,null,null,null,null,null,null,null,null,null,null,null,null,null,null,null,null,null,null,null,null,null,52548175,"VEGA","APÁCZAI","MATILDA","RENATA","Dirección de Signos Distintivos","- Grupo de Trabajo de Fondo","Dirección de Signos Distintivos - Grupo de Trabajo de Fondo","Profesional Universitario (Prov)","PROFESIONAL",2044,11]
[null,null,null,null,null,null,null,null,null,null,null,null,null,null,null,"2017-07-11",null,null,null,null,null,null,null,null,null,null,56.699999999999797,"NO SATISFACTORIO",null,null,null,null,null,null,null,null,null,null,null,null,null,null,null,null,null,null,null,null,null,null,null,null,79810281,"VEGA","RUSSI","HAROLD","SNEHYDER","Dirección de Nuevas Creaciones","- Grupo de Trabajo del Sector de Ingenierías","Dirección de Nuevas Creaciones - Grupo de Trabajo del Sector de Ingenierías","Profesional Universitario (Prov)","PROFESIONAL",2044,"03"]
[null,null,null,null,null,null,null,null,null,null,null,null,null,null,null,"2017-07-12",null,null,null,null,null,null,null,null,null,null,56.799999999999798,"NO SATISFACTORIO",null,null,null,null,null,null,null,null,null,null,null,null,null,null,null,null,null,null,null,null,null,null,null,null,39693742,"VEGA","VÁSQUEZ","CLARA","INÉS","Oficina Asesora Jurídica","","Oficina Asesora Jurídica ","Profesional Universitario (Prov)","PROFESIONAL",2044,"09"]
[null,null,null,null,null,null,null,null,null,null,null,null,null,null,null,"2017-07-13",null,null,null,null,null,null,null,null,null,null,56.8999999999998,"NO SATISFACTORIO",null,null,null,null,null,null,null,null,null,null,null,null,null,null,null,null,null,null,null,null,null,null,null,null,79421543,"VELANDIA","CARREÑO","ARCESIO"," -","Dirección de Investigaciones para el Control y Verificación de Reglamentos Técnicos y Metrología Legal","- Grupo de Trabajo de Inspección y Vigilancia de Metrología Legal","Dirección de Investigaciones para el Control y Verificación de Reglamentos Técnicos y Metrología Legal - Grupo de Trabajo de Inspección y Vigilancia de Metrología Legal","Profesional Universitario (E)","PROFESIONAL",2044,11]
[null,null,null,null,null,null,null,null,null,null,null,null,null,null,null,"2017-07-14",null,null,null,null,null,null,null,null,null,null,56.999999999999801,"NO SATISFACTORIO",null,null,null,null,null,null,null,null,null,null,null,null,null,null,null,null,null,null,null,null,null,null,null,null,80097421,"VELANDIA","CHITIVA","FABIAN","EMILIANI","Secretaría General","- Grupo de Trabajo de Talento Humano","Secretaría General - Grupo de Trabajo de Talento Humano","Auxiliar Administrativo (Prov)","ASISTENCIAL",4044,11]
[null,null,null,null,null,null,null,null,null,null,null,null,null,null,null,"2017-07-15",null,null,null,null,null,null,null,null,null,null,57.099999999999802,"NO SATISFACTORIO",null,null,null,null,null,null,null,null,null,null,null,null,null,null,null,null,null,null,null,null,null,null,null,null,38641040,"VELASCO","SAAVEDRA","JULIANA","MARÍA","Despacho del Superintendente Delegado para la Propiedad Industrial","- Grupo de Trabajo de Vía Gubernativa","Despacho del Superintendente Delegado para la Propiedad Industrial - Grupo de Trabajo de Vía Gubernativa","Profesional Universitario (Prov)","PROFESIONAL",2044,"09"]
[null,null,null,null,null,null,null,null,null,null,null,null,null,null,null,"2017-07-16",null,null,null,null,null,null,null,null,null,null,57.199999999999797,"NO SATISFACTORIO",null,null,null,null,null,null,null,null,null,null,null,null,null,null,null,null,null,null,null,null,null,null,null,null,52452042,"VELEZ","GARCIA","GYNNA","MARÍA","Dirección Financiera",null,"Dirección Financiera ","Profesional Universitario (Prov)","PROFESIONAL",2044,"03"]
[null,null,null,null,null,null,null,null,null,null,null,null,null,null,null,"2017-07-17",null,null,null,null,null,null,null,null,null,null,57.299999999999798,"NO SATISFACTORIO",null,null,null,null,null,null,null,null,null,null,null,null,null,null,null,null,null,null,null,null,null,null,null,null,1110486889,"VÉLEZ","HERNÁNDEZ","ANDRÉS","LISÍMACO","Despacho del Superintendente Delegado para Asuntos Jurisdiccionales","- Grupo de Trabajo de Defensa del Consumidor","Despacho del Superintendente Delegado para Asuntos Jurisdiccionales - Grupo de Trabajo de Defensa del Consumidor","Profesional Universitario (Prov)","PROFESIONAL",2044,"03"]
[null,null,null,null,null,null,null,null,null,null,null,null,null,null,null,"2017-07-18",null,null,null,null,null,null,null,null,null,null,57.3999999999998,"NO SATISFACTORIO",null,null,null,null,null,null,null,null,null,null,null,null,null,null,null,null,null,null,null,null,null,null,null,null,51848755,"VILLAMIL","HERNÁNDEZ","LILIANA","MYRIAM","Despacho del Superintendente Delegado para la Propiedad Industrial","- Grupo de Trabajo de Centro de Información Tecnológica y Apoyo a la Gestión de la Propiedad Industrial","Despacho del Superintendente Delegado para la Propiedad Industrial - Grupo de Trabajo de Centro de Información Tecnológica y Apoyo a la Gestión de la Propiedad Industrial","Profesional Universitario (E)","PROFESIONAL",2044,10]
[null,null,null,null,null,null,null,null,null,null,null,null,null,null,null,"2017-07-19",null,null,null,null,null,null,null,null,null,null,57.499999999999801,"NO SATISFACTORIO",null,null,null,null,null,null,null,null,null,null,null,null,null,null,null,null,null,null,null,null,null,null,null,null,53105606,"VILLATE","BECERRA","JENY","PAOLA","Dirección de Nuevas Creaciones","- Grupo de Trabajo de Ciencias Farmacéuticas y Biológicas","Dirección de Nuevas Creaciones - Grupo de Trabajo de Ciencias Farmacéuticas y Biológicas","Profesional Universitario (Prov)","PROFESIONAL",2044,"07"]
[null,null,null,null,null,null,null,null,null,null,null,null,null,null,null,"2017-07-20",null,null,null,null,null,null,null,null,null,null,57.599999999999802,"NO SATISFACTORIO",null,null,null,null,null,null,null,null,null,null,null,null,null,null,null,null,null,null,null,null,null,null,null,null,79504189,"VILLAVICENCIO","REYES","RICHARD","GLEEM","Dirección Administrativa","- Grupo de Trabajo de Gestión Documental y Recursos Físicos","Dirección Administrativa - Grupo de Trabajo de Gestión Documental y Recursos Físicos","Técnico Administrativo (Prov)","TECNICO",3124,"07"]
[null,null,null,null,null,null,null,null,null,null,null,null,null,null,null,"2017-07-21",null,null,null,null,null,null,null,null,null,null,57.699999999999797,"NO SATISFACTORIO",null,null,null,null,null,null,null,null,null,null,null,null,null,null,null,null,null,null,null,null,null,null,null,null,35428182,"VILLEGAS","RINCÓN","JOANNE","NICOLE","Despacho del Superintendente Delegado para Asuntos Jurisdiccionales","- Grupo de Trabajo de Defensa del Consumidor","Despacho del Superintendente Delegado para Asuntos Jurisdiccionales - Grupo de Trabajo de Defensa del Consumidor","Profesional Universitario (Prov)","PROFESIONAL",2044,"05"]
[null,null,null,null,null,null,null,null,null,null,null,null,null,null,null,"2017-07-22",null,null,null,null,null,null,null,null,null,null,57.799999999999798,"NO SATISFACTORIO",null,null,null,null,null,null,null,null,null,null,null,null,null,null,null,null,null,null,null,null,null,null,null,null,52199572,"ZAMBRANO","ROCHA","DIANA","ALEXANDRA","Oficina Asesora de Planeación","","Oficina Asesora de Planeación ","Profesional Universitario (Prov)","PROFESIONAL",2044,"09"]
[null,null,null,null,null,null,null,null,null,null,null,null,null,null,null,"2017-07-23",null,null,null,null,null,null,null,null,null,null,57.8999999999998,"NO SATISFACTORIO",null,null,null,null,null,null,null,null,null,null,null,null,null,null,null,null,null,null,null,null,null,null,null,null,80020246,"ZAMBRANO","ULLOA","MIGUEL","ANGEL","Dirección Administrativa","- Grupo de Trabajo de Gestión Documental y Recursos Físicos","Dirección Administrativa - Grupo de Trabajo de Gestión Documental y Recursos Físicos","Técnico Administrativo (Prov)","TECNICO",3124,"07"]
[null,null,null,null,null,null,null,null,null,null,null,null,null,null,null,"2017-07-24",null,null,null,null,null,null,null,null,null,null,57.999999999999801,"NO SATISFACTORIO",null,null,null,null,null,null,null,null,null,null,null,null,null,null,null,null,null,null,null,null,null,null,null,null,17659276,"ZAPATA","GARCÍA","CARLOS","ANDRÉS","Despacho del Superintendente Delegado para Asuntos Jurisdiccionales","- Grupo de Trabajo de Calificación","Despacho del Superintendente Delegado para Asuntos Jurisdiccionales - Grupo de Trabajo de Calificación","Profesional Universitario (Prov)","PROFESIONAL",2044,"01"]
[null,null,null,null,null,null,null,null,null,null,null,null,null,null,null,"2017-07-25",null,null,null,null,null,null,null,null,null,null,58.099999999999802,"NO SATISFACTORIO",null,null,null,null,null,null,null,null,null,null,null,null,null,null,null,null,null,null,null,null,null,null,null,null,52872647,"ZARRATE","SALDAÑA","MAGDA","JULIETH","Oficina de Control Interno","","Oficina de Control Interno ","Secretario (Prov)","ASISTENCIAL",4178,13]
[null,null,null,null,null,null,null,null,null,null,null,null,null,null,null,"2017-07-26",null,null,null,null,null,null,null,null,null,null,58.199999999999797,"NO SATISFACTORIO",null,null,null,null,null,null,null,null,null,null,null,null,null,null,null,null,null,null,null,null,null,null,null,null,1032357778,"ZUAÍN","DURÁN","EDISON","DE LA PALMA","Dirección de Signos Distintivos","- Grupo de Trabajo de Forma","Dirección de Signos Distintivos - Grupo de Trabajo de Forma","Profesional Universitario (Prov)","PROFESIONAL",2044,"01"]
[null,null,null,null,null,null,null,null,null,null,null,null,null,null,null,"2017-07-27",null,null,null,null,null,null,null,null,null,null,58.299999999999798,"NO SATISFACTORIO",null,null,null,null,null,null,null,null,null,null,null,null,null,null,null,null,null,null,null,null,null,null,null,null,51729647,"ZULUAGA","ISAZA","CLAUDIA","NINA DEL SOCORRO","Dirección de Cámaras de Comercio",null,"Dirección de Cámaras de Comercio ","Director de Superintendencia","DIRECTIVO","0105",11]
[null,null,null,null,null,null,null,null,null,null,null,null,null,null,null,"2017-07-28",null,null,null,null,null,null,null,null,null,null,58.3999999999998,"NO SATISFACTORIO",null,null,null,null,null,null,null,null,null,null,null,null,null,null,null,null,null,null,null,null,null,null,null,null,24865872,"ZULUAGA","RAMÍREZ","LUZ","MARINA","Dirección de Investigaciones de Protección al Consumidor","","Dirección de Investigaciones de Protección al Consumidor ","Profesional Especializado (E)","PROFESIONAL",2028,13]
[null,null,null,null,null,null,null,null,null,null,null,null,null,null,null,"2017-07-29",null,null,null,null,null,null,null,null,null,null,58.499999999999801,"NO SATISFACTORIO",null,null,null,null,null,null,null,null,null,null,null,null,null,null,null,null,null,null,null,null,null,null,null,null,1032357778,"ZUAÍN","DURÁN","EDISON","DE LA PALMA","Dirección de Signos Distintivos","- Grupo de Trabajo de Forma","Dirección de Signos Distintivos - Grupo de Trabajo de Forma","Profesional Universitario (Prov)","PROFESIONAL",2044,"01"]
[null,null,null,null,null,null,null,null,null,null,null,null,null,null,null,"2017-07-30",null,null,null,null,null,null,null,null,null,null,58.599999999999802,"NO SATISFACTORIO",null,null,null,null,null,null,null,null,null,null,null,null,null,null,null,null,null,null,null,null,null,null,null,null,51729647,"ZULUAGA","ISAZA","CLAUDIA","NINA DEL SOCORRO","Dirección de Cámaras de Comercio",null,"Dirección de Cámaras de Comercio ","Director de Superintendencia","DIRECTIVO","0105","11"]
[null,null,null,null,null,null,null,null,null,null,null,null,null,null,null,"2017-07-31",null,null,null,null,null,null,null,null,null,null,58.699999999999797,"NO SATISFACTORIO",null,null,null,null,null,null,null,null,null,null,null,null,null,null,null,null,null,null,null,null,null,null,null,null,24865872,"ZULUAGA","RAMÍREZ","LUZ","MARINA","Dirección de Investigaciones de Protección al Consumidor","","Dirección de Investigaciones de Protección al Consumidor ","Profesional Especializado (E)","PROFESIONAL",2028,"13"]
[null,null,null,null,null,null,null,null,null,null,null,null,null,null,null,"2017-08-01",null,null,null,null,null,null,null,null,null,null,58.799999999999798,"NO SATISFACTORIO"]
[null,null,null,null,null,null,null,null,null,null,null,null,null,null,null,"2017-08-02",null,null,null,null,null,null,null,null,null,null,58.8999999999998,"NO SATISFACTORIO"]
[null,null,null,null,null,null,null,null,null,null,null,null,null,null,null,"2017-08-03",null,null,null,null,null,null,null,null,null,null,58.999999999999801,"NO SATISFACTORIO"]
[null,null,null,null,null,null,null,null,null,null,null,null,null,null,null,"2017-08-04",null,null,null,null,null,null,null,null,null,null,59.099999999999802,"NO SATISFACTORIO"]
[null,null,null,null,null,null,null,null,null,null,null,null,null,null,null,"2017-08-05",null,null,null,null,null,null,null,null,null,null,59.199999999999797,"NO SATISFACTORIO"]
[null,null,null,null,null,null,null,null,null,null,null,null,null,null,null,"2017-08-06",null,null,null,null,null,null,null,null,null,null,59.299999999999798,"NO SATISFACTORIO"]
[null,null,null,null,null,null,null,null,null,null,null,null,null,null,null,"2017-08-07",null,null,null,null,null,null,null,null,null,null,59.3999999999998,"NO SATISFACTORIO"]
[null,null,null,null,null,null,null,null,null,null,null,null,null,null,null,"2017-08-08",null,null,null,null,null,null,null,null,null,null,59.499999999999801,"NO SATISFACTORIO"]
[null,null,null,null,null,null,null,null,null,null,null,null,null,null,null,"2017-08-09",null,null,null,null,null,null,null,null,null,null,59.599999999999802,"NO SATISFACTORIO"]
[null,null,null,null,null,null,null,null,null,null,null,null,null,null,null,"2017-08-10",null,null,null,null,null,null,null,null,null,null,59.699999999999797,"NO SATISFACTORIO"]
[null,null,null,null,null,null,null,null,null,null,null,null,null,null,null,"2017-08-11",null,null,null,null,null,null,null,null,null,null,59.799999999999798,"NO SATISFACTORIO"]
[null,null,null,null,null,null,null,null,null,null,null,null,null,null,null,"2017-08-12",null,null,null,null,null,null,null,null,null,null,59.8999999999998,"NO SATISFACTORIO"]
[null,null,null,null,null,null,null,null,null,null,null,null,null,null,null,"2017-08-13",null,null,null,null,null,null,null,null,null,null,59.999999999999801,"NO SATISFACTORIO"]
[null,null,null,null,null,null,null,null,null,null,null,null,null,null,null,"2017-08-14",null,null,null,null,null,null,null,null,null,null,60.099999999999802,"NO SATISFACTORIO"]
[null,null,null,null,null,null,null,null,null,null,null,null,null,null,null,"2017-08-15",null,null,null,null,null,null,null,null,null,null,60.199999999999797,"NO SATISFACTORIO"]
[null,null,null,null,null,null,null,null,null,null,null,null,null,null,null,"2017-08-16",null,null,null,null,null,null,null,null,null,null,60.299999999999798,"NO SATISFACTORIO"]
[null,null,null,null,null,null,null,null,null,null,null,null,null,null,null,"2017-08-17",null,null,null,null,null,null,null,null,null,null,60.3999999999998,"NO SATISFACTORIO"]
[null,null,null,null,null,null,null,null,null,null,null,null,null,null,null,"2017-08-18",null,null,null,null,null,null,null,null,null,null,60.499999999999801,"NO SATISFACTORIO"]
[null,null,null,null,null,null,null,null,null,null,null,null,null,null,null,"2017-08-19",null,null,null,null,null,null,null,null,null,null,60.599999999999802,"NO SATISFACTORIO"]
[null,null,null,null,null,null,null,null,null,null,null,null,null,null,null,"2017-08-20",null,null,null,null,null,null,null,null,null,null,60.699999999999797,"NO SATISFACTORIO"]
[null,null,null,null,null,null,null,null,null,null,null,null,null,null,null,"2017-08-21",null,null,null,null,null,null,null,null,null,null,60.799999999999798,"NO SATISFACTORIO"]
[null,null,null,null,null,null,null,null,null,null,null,null,null,null,null,"2017-08-22",null,null,null,null,null,null,null,null,null,null,60.8999999999998,"NO SATISFACTORIO"]
[null,null,null,null,null,null,null,null,null,null,null,null,null,null,null,"2017-08-23",null,null,null,null,null,null,null,null,null,null,60.999999999999801,"NO SATISFACTORIO"]
[null,null,null,null,null,null,null,null,null,null,null,null,null,null,null,"2017-08-24",null,null,null,null,null,null,null,null,null,null,61.099999999999802,"NO SATISFACTORIO"]
[null,null,null,null,null,null,null,null,null,null,null,null,null,null,null,"2017-08-25",null,null,null,null,null,null,null,null,null,null,61.199999999999797,"NO SATISFACTORIO"]
[null,null,null,null,null,null,null,null,null,null,null,null,null,null,null,"2017-08-26",null,null,null,null,null,null,null,null,null,null,61.299999999999798,"NO SATISFACTORIO"]
[null,null,null,null,null,null,null,null,null,null,null,null,null,null,null,"2017-08-27",null,null,null,null,null,null,null,null,null,null,61.3999999999998,"NO SATISFACTORIO"]
[null,null,null,null,null,null,null,null,null,null,null,null,null,null,null,"2017-08-28",null,null,null,null,null,null,null,null,null,null,61.499999999999801,"NO SATISFACTORIO"]
[null,null,null,null,null,null,null,null,null,null,null,null,null,null,null,"2017-08-29",null,null,null,null,null,null,null,null,null,null,61.599999999999802,"NO SATISFACTORIO"]
[null,null,null,null,null,null,null,null,null,null,null,null,null,null,null,"2017-08-30",null,null,null,null,null,null,null,null,null,null,61.699999999999797,"NO SATISFACTORIO"]
[null,null,null,null,null,null,null,null,null,null,null,null,null,null,null,"2017-08-31",null,null,null,null,null,null,null,null,null,null,61.799999999999798,"NO SATISFACTORIO"]
[null,null,null,null,null,null,null,null,null,null,null,null,null,null,null,"2017-09-01",null,null,null,null,null,null,null,null,null,null,61.8999999999998,"NO SATISFACTORIO"]
[null,null,null,null,null,null,null,null,null,null,null,null,null,null,null,"2017-09-02",null,null,null,null,null,null,null,null,null,null,61.999999999999801,"NO SATISFACTORIO"]
[null,null,null,null,null,null,null,null,null,null,null,null,null,null,null,"2017-09-03",null,null,null,null,null,null,null,null,null,null,62.099999999999802,"NO SATISFACTORIO"]
[null,null,null,null,null,null,null,null,null,null,null,null,null,null,null,"2017-09-04",null,null,null,null,null,null,null,null,null,null,62.199999999999797,"NO SATISFACTORIO"]
[null,null,null,null,null,null,null,null,null,null,null,null,null,null,null,"2017-09-05",null,null,null,null,null,null,null,null,null,null,62.299999999999798,"NO SATISFACTORIO"]
[null,null,null,null,null,null,null,null,null,null,null,null,null,null,null,"2017-09-06",null,null,null,null,null,null,null,null,null,null,62.3999999999998,"NO SATISFACTORIO"]
[null,null,null,null,null,null,null,null,null,null,null,null,null,null,null,"2017-09-07",null,null,null,null,null,null,null,null,null,null,62.499999999999801,"NO SATISFACTORIO"]
[null,null,null,null,null,null,null,null,null,null,null,null,null,null,null,"2017-09-08",null,null,null,null,null,null,null,null,null,null,62.599999999999802,"NO SATISFACTORIO"]
[null,null,null,null,null,null,null,null,null,null,null,null,null,null,null,"2017-09-09",null,null,null,null,null,null,null,null,null,null,62.699999999999797,"NO SATISFACTORIO"]
[null,null,null,null,null,null,null,null,null,null,null,null,null,null,null,"2017-09-10",null,null,null,null,null,null,null,null,null,null,62.799999999999798,"NO SATISFACTORIO"]
[null,null,null,null,null,null,null,null,null,null,null,null,null,null,null,"2017-09-11",null,null,null,null,null,null,null,null,null,null,62.8999999999998,"NO SATISFACTORIO"]
[null,null,null,null,null,null,null,null,null,null,null,null,null,null,null,"2017-09-12",null,null,null,null,null,null,null,null,null,null,62.999999999999801,"NO SATISFACTORIO"]
[null,null,null,null,null,null,null,null,null,null,null,null,null,null,null,"2017-09-13",null,null,null,null,null,null,null,null,null,null,63.099999999999802,"NO SATISFACTORIO"]
[null,null,null,null,null,null,null,null,null,null,null,null,null,null,null,"2017-09-14",null,null,null,null,null,null,null,null,null,null,63.199999999999797,"NO SATISFACTORIO"]
[null,null,null,null,null,null,null,null,null,null,null,null,null,null,null,"2017-09-15",null,null,null,null,null,null,null,null,null,null,63.299999999999798,"NO SATISFACTORIO"]
[null,null,null,null,null,null,null,null,null,null,null,null,null,null,null,"2017-09-16",null,null,null,null,null,null,null,null,null,null,63.3999999999998,"NO SATISFACTORIO"]
[null,null,null,null,null,null,null,null,null,null,null,null,null,null,null,"2017-09-17",null,null,null,null,null,null,null,null,null,null,63.499999999999801,"NO SATISFACTORIO"]
[null,null,null,null,null,null,null,null,null,null,null,null,null,null,null,"2017-09-18",null,null,null,null,null,null,null,null,null,null,63.599999999999802,"NO SATISFACTORIO"]
[null,null,null,null,null,null,null,null,null,null,null,null,null,null,null,"2017-09-19",null,null,null,null,null,null,null,null,null,null,63.699999999999797,"NO SATISFACTORIO"]
[null,null,null,null,null,null,null,null,null,null,null,null,null,null,null,"2017-09-20",null,null,null,null,null,null,null,null,null,null,63.799999999999798,"NO SATISFACTORIO"]
[null,null,null,null,null,null,null,null,null,null,null,null,null,null,null,"2017-09-21",null,null,null,null,null,null,null,null,null,null,63.8999999999998,"NO SATISFACTORIO"]
[null,null,null,null,null,null,null,null,null,null,null,null,null,null,null,"2017-09-22",null,null,null,null,null,null,null,null,null,null,63.999999999999801,"NO SATISFACTORIO"]
[null,null,null,null,null,null,null,null,null,null,null,null,null,null,null,"2017-09-23",null,null,null,null,null,null,null,null,null,null,64.099999999999795,"NO SATISFACTORIO"]
[null,null,null,null,null,null,null,null,null,null,null,null,null,null,null,"2017-09-24",null,null,null,null,null,null,null,null,null,null,64.199999999999804,"NO SATISFACTORIO"]
[null,null,null,null,null,null,null,null,null,null,null,null,null,null,null,"2017-09-25",null,null,null,null,null,null,null,null,null,null,64.299999999999798,"NO SATISFACTORIO"]
[null,null,null,null,null,null,null,null,null,null,null,null,null,null,null,"2017-09-26",null,null,null,null,null,null,null,null,null,null,64.399999999999807,"NO SATISFACTORIO"]
[null,null,null,null,null,null,null,null,null,null,null,null,null,null,null,"2017-09-27",null,null,null,null,null,null,null,null,null,null,64.499999999999801,"NO SATISFACTORIO"]
[null,null,null,null,null,null,null,null,null,null,null,null,null,null,null,"2017-09-28",null,null,null,null,null,null,null,null,null,null,64.599999999999795,"NO SATISFACTORIO"]
[null,null,null,null,null,null,null,null,null,null,null,null,null,null,null,"2017-09-29",null,null,null,null,null,null,null,null,null,null,64.699999999999804,"NO SATISFACTORIO"]
[null,null,null,null,null,null,null,null,null,null,null,null,null,null,null,"2017-09-30",null,null,null,null,null,null,null,null,null,null,64.799999999999798,"NO SATISFACTORIO"]
[null,null,null,null,null,null,null,null,null,null,null,null,null,null,null,"2017-10-01",null,null,null,null,null,null,null,null,null,null,64.899999999999807,"NO SATISFACTORIO"]
[null,null,null,null,null,null,null,null,null,null,null,null,null,null,null,"2017-10-02",null,null,null,null,null,null,null,null,null,null,64.999999999999801,"NO SATISFACTORIO"]
[null,null,null,null,null,null,null,null,null,null,null,null,null,null,null,"2017-10-03",null,null,null,null,null,null,null,null,null,null,65.099999999999795,"SATISFACTORIO"]
[null,null,null,null,null,null,null,null,null,null,null,null,null,null,null,"2017-10-04",null,null,null,null,null,null,null,null,null,null,65.199999999999804,"SATISFACTORIO"]
[null,null,null,null,null,null,null,null,null,null,null,null,null,null,null,"2017-10-05",null,null,null,null,null,null,null,null,null,null,65.299999999999798,"SATISFACTORIO"]
[null,null,null,null,null,null,null,null,null,null,null,null,null,null,null,"2017-10-06",null,null,null,null,null,null,null,null,null,null,65.399999999999807,"SATISFACTORIO"]
[null,null,null,null,null,null,null,null,null,null,null,null,null,null,null,"2017-10-07",null,null,null,null,null,null,null,null,null,null,65.499999999999801,"SATISFACTORIO"]
[null,null,null,null,null,null,null,null,null,null,null,null,null,null,null,"2017-10-08",null,null,null,null,null,null,null,null,null,null,65.599999999999795,"SATISFACTORIO"]
[null,null,null,null,null,null,null,null,null,null,null,null,null,null,null,"2017-10-09",null,null,null,null,null,null,null,null,null,null,65.699999999999804,"SATISFACTORIO"]
[null,null,null,null,null,null,null,null,null,null,null,null,null,null,null,"2017-10-10",null,null,null,null,null,null,null,null,null,null,65.799999999999798,"SATISFACTORIO"]
[null,null,null,null,null,null,null,null,null,null,null,null,null,null,null,"2017-10-11",null,null,null,null,null,null,null,null,null,null,65.899999999999807,"SATISFACTORIO"]
[null,null,null,null,null,null,null,null,null,null,null,null,null,null,null,"2017-10-12",null,null,null,null,null,null,null,null,null,null,65.999999999999801,"SATISFACTORIO"]
[null,null,null,null,null,null,null,null,null,null,null,null,null,null,null,"2017-10-13",null,null,null,null,null,null,null,null,null,null,66.099999999999795,"SATISFACTORIO"]
[null,null,null,null,null,null,null,null,null,null,null,null,null,null,null,"2017-10-14",null,null,null,null,null,null,null,null,null,null,66.199999999999804,"SATISFACTORIO"]
[null,null,null,null,null,null,null,null,null,null,null,null,null,null,null,"2017-10-15",null,null,null,null,null,null,null,null,null,null,66.299999999999798,"SATISFACTORIO"]
[null,null,null,null,null,null,null,null,null,null,null,null,null,null,null,"2017-10-16",null,null,null,null,null,null,null,null,null,null,66.399999999999807,"SATISFACTORIO"]
[null,null,null,null,null,null,null,null,null,null,null,null,null,null,null,"2017-10-17",null,null,null,null,null,null,null,null,null,null,66.499999999999801,"SATISFACTORIO"]
[null,null,null,null,null,null,null,null,null,null,null,null,null,null,null,"2017-10-18",null,null,null,null,null,null,null,null,null,null,66.599999999999795,"SATISFACTORIO"]
[null,null,null,null,null,null,null,null,null,null,null,null,null,null,null,"2017-10-19",null,null,null,null,null,null,null,null,null,null,66.699999999999804,"SATISFACTORIO"]
[null,null,null,null,null,null,null,null,null,null,null,null,null,null,null,"2017-10-20",null,null,null,null,null,null,null,null,null,null,66.799999999999798,"SATISFACTORIO"]
[null,null,null,null,null,null,null,null,null,null,null,null,null,null,null,"2017-10-21",null,null,null,null,null,null,null,null,null,null,66.899999999999807,"SATISFACTORIO"]
[null,null,null,null,null,null,null,null,null,null,null,null,null,null,null,"2017-10-22",null,null,null,null,null,null,null,null,null,null,66.999999999999801,"SATISFACTORIO"]
[null,null,null,null,null,null,null,null,null,null,null,null,null,null,null,"2017-10-23",null,null,null,null,null,null,null,null,null,null,67.099999999999795,"SATISFACTORIO"]
[null,null,null,null,null,null,null,null,null,null,null,null,null,null,null,"2017-10-24",null,null,null,null,null,null,null,null,null,null,67.199999999999804,"SATISFACTORIO"]
[null,null,null,null,null,null,null,null,null,null,null,null,null,null,null,"2017-10-25",null,null,null,null,null,null,null,null,null,null,67.299999999999798,"SATISFACTORIO"]
[null,null,null,null,null,null,null,null,null,null,null,null,null,null,null,"2017-10-26",null,null,null,null,null,null,null,null,null,null,67.399999999999807,"SATISFACTORIO"]
[null,null,null,null,null,null,null,null,null,null,null,null,null,null,null,"2017-10-27",null,null,null,null,null,null,null,null,null,null,67.499999999999801,"SATISFACTORIO"]
[null,null,null,null,null,null,null,null,null,null,null,null,null,null,null,"2017-10-28",null,null,null,null,null,null,null,null,null,null,67.599999999999795,"SATISFACTORIO"]
[null,null,null,null,null,null,null,null,null,null,null,null,null,null,null,"2017-10-29",null,null,null,null,null,null,null,null,null,null,67.699999999999804,"SATISFACTORIO"]
[null,null,null,null,null,null,null,null,null,null,null,null,null,null,null,"2017-10-30",null,null,null,null,null,null,null,null,null,null,67.799999999999798,"SATISFACTORIO"]
[null,null,null,null,null,null,null,null,null,null,null,null,null,null,null,"2017-10-31",null,null,null,null,null,null,null,null,null,null,67.899999999999807,"SATISFACTORIO"]
[null,null,null,null,null,null,null,null,null,null,null,null,null,null,null,"2017-11-01",null,null,null,null,null,null,null,null,null,null,67.999999999999801,"SATISFACTORIO"]
[null,null,null,null,null,null,null,null,null,null,null,null,null,null,null,"2017-11-02",null,null,null,null,null,null,null,null,null,null,68.099999999999795,"SATISFACTORIO"]
[null,null,null,null,null,null,null,null,null,null,null,null,null,null,null,"2017-11-03",null,null,null,null,null,null,null,null,null,null,68.199999999999804,"SATISFACTORIO"]
[null,null,null,null,null,null,null,null,null,null,null,null,null,null,null,"2017-11-04",null,null,null,null,null,null,null,null,null,null,68.299999999999798,"SATISFACTORIO"]
[null,null,null,null,null,null,null,null,null,null,null,null,null,null,null,"2017-11-05",null,null,null,null,null,null,null,null,null,null,68.399999999999807,"SATISFACTORIO"]
[null,null,null,null,null,null,null,null,null,null,null,null,null,null,null,"2017-11-06",null,null,null,null,null,null,null,null,null,null,68.499999999999801,"SATISFACTORIO"]
[null,null,null,null,null,null,null,null,null,null,null,null,null,null,null,"2017-11-07",null,null,null,null,null,null,null,null,null,null,68.599999999999795,"SATISFACTORIO"]
[null,null,null,null,null,null,null,null,null,null,null,null,null,null,null,"2017-11-08",null,null,null,null,null,null,null,null,null,null,68.699999999999804,"SATISFACTORIO"]
[null,null,null,null,null,null,null,null,null,null,null,null,null,null,null,"2017-11-09",null,null,null,null,null,null,null,null,null,null,68.799999999999798,"SATISFACTORIO"]
[null,null,null,null,null,null,null,null,null,null,null,null,null,null,null,"2017-11-10",null,null,null,null,null,null,null,null,null,null,68.899999999999807,"SATISFACTORIO"]
[null,null,null,null,null,null,null,null,null,null,null,null,null,null,null,"2017-11-11",null,null,null,null,null,null,null,null,null,null,68.999999999999801,"SATISFACTORIO"]
[null,null,null,null,null,null,null,null,null,null,null,null,null,null,null,"2017-11-12",null,null,null,null,null,null,null,null,null,null,69.099999999999795,"SATISFACTORIO"]
[null,null,null,null,null,null,null,null,null,null,null,null,null,null,null,"2017-11-13",null,null,null,null,null,null,null,null,null,null,69.199999999999804,"SATISFACTORIO"]
[null,null,null,null,null,null,null,null,null,null,null,null,null,null,null,"2017-11-14",null,null,null,null,null,null,null,null,null,null,69.299999999999798,"SATISFACTORIO"]
[null,null,null,null,null,null,null,null,null,null,null,null,null,null,null,"2017-11-15",null,null,null,null,null,null,null,null,null,null,69.399999999999807,"SATISFACTORIO"]
[null,null,null,null,null,null,null,null,null,null,null,null,null,null,null,"2017-11-16",null,null,null,null,null,null,null,null,null,null,69.499999999999801,"SATISFACTORIO"]
[null,null,null,null,null,null,null,null,null,null,null,null,null,null,null,"2017-11-17",null,null,null,null,null,null,null,null,null,null,69.599999999999795,"SATISFACTORIO"]
[null,null,null,null,null,null,null,null,null,null,null,null,null,null,null,"2017-11-18",null,null,null,null,null,null,null,null,null,null,69.699999999999804,"SATISFACTORIO"]
[null,null,null,null,null,null,null,null,null,null,null,null,null,null,null,"2017-11-19",null,null,null,null,null,null,null,null,null,null,69.799999999999798,"SATISFACTORIO"]
[null,null,null,null,null,null,null,null,null,null,null,null,null,null,null,"2017-11-20",null,null,null,null,null,null,null,null,null,null,69.899999999999807,"SATISFACTORIO"]
[null,null,null,null,null,null,null,null,null,null,null,null,null,null,null,"2017-11-21",null,null,null,null,null,null,null,null,null,null,69.999999999999801,"SATISFACTORIO"]
[null,null,null,null,null,null,null,null,null,null,null,null,null,null,null,"2017-11-22",null,null,null,null,null,null,null,null,null,null,70.099999999999795,"SATISFACTORIO"]
[null,null,null,null,null,null,null,null,null,null,null,null,null,null,null,"2017-11-23",null,null,null,null,null,null,null,null,null,null,70.199999999999804,"SATISFACTORIO"]
[null,null,null,null,null,null,null,null,null,null,null,null,null,null,null,"2017-11-24",null,null,null,null,null,null,null,null,null,null,70.299999999999798,"SATISFACTORIO"]
[null,null,null,null,null,null,null,null,null,null,null,null,null,null,null,"2017-11-25",null,null,null,null,null,null,null,null,null,null,70.399999999999807,"SATISFACTORIO"]
[null,null,null,null,null,null,null,null,null,null,null,null,null,null,null,"2017-11-26",null,null,null,null,null,null,null,null,null,null,70.499999999999801,"SATISFACTORIO"]
[null,null,null,null,null,null,null,null,null,null,null,null,null,null,null,"2017-11-27",null,null,null,null,null,null,null,null,null,null,70.599999999999795,"SATISFACTORIO"]
[null,null,null,null,null,null,null,null,null,null,null,null,null,null,null,"2017-11-28",null,null,null,null,null,null,null,null,null,null,70.699999999999804,"SATISFACTORIO"]
[null,null,null,null,null,null,null,null,null,null,null,null,null,null,null,"2017-11-29",null,null,null,null,null,null,null,null,null,null,70.799999999999798,"SATISFACTORIO"]
[null,null,null,null,null,null,null,null,null,null,null,null,null,null,null,"2017-11-30",null,null,null,null,null,null,null,null,null,null,70.899999999999807,"SATISFACTORIO"]
[null,null,null,null,null,null,null,null,null,null,null,null,null,null,null,"2017-12-01",null,null,null,null,null,null,null,null,null,null,70.999999999999801,"SATISFACTORIO"]
[null,null,null,null,null,null,null,null,null,null,null,null,null,null,null,"2017-12-02",null,null,null,null,null,null,null,null,null,null,71.099999999999795,"SATISFACTORIO"]
[null,null,null,null,null,null,null,null,null,null,null,null,null,null,null,"2017-12-03",null,null,null,null,null,null,null,null,null,null,71.199999999999804,"SATISFACTORIO"]
[null,null,null,null,null,null,null,null,null,null,null,null,null,null,null,"2017-12-04",null,null,null,null,null,null,null,null,null,null,71.299999999999798,"SATISFACTORIO"]
[null,null,null,null,null,null,null,null,null,null,null,null,null,null,null,"2017-12-05",null,null,null,null,null,null,null,null,null,null,71.399999999999807,"SATISFACTORIO"]
[null,null,null,null,null,null,null,null,null,null,null,null,null,null,null,"2017-12-06",null,null,null,null,null,null,null,null,null,null,71.499999999999801,"SATISFACTORIO"]
[null,null,null,null,null,null,null,null,null,null,null,null,null,null,null,"2017-12-07",null,null,null,null,null,null,null,null,null,null,71.599999999999795,"SATISFACTORIO"]
[null,null,null,null,null,null,null,null,null,null,null,null,null,null,null,"2017-12-08",null,null,null,null,null,null,null,null,null,null,71.699999999999804,"SATISFACTORIO"]
[null,null,null,null,null,null,null,null,null,null,null,null,null,null,null,"2017-12-09",null,null,null,null,null,null,null,null,null,null,71.799999999999798,"SATISFACTORIO"]
[null,null,null,null,null,null,null,null,null,null,null,null,null,null,null,"2017-12-10",null,null,null,null,null,null,null,null,null,null,71.899999999999807,"SATISFACTORIO"]
[null,null,null,null,null,null,null,null,null,null,null,null,null,null,null,"2017-12-11",null,null,null,null,null,null,null,null,null,null,71.999999999999801,"SATISFACTORIO"]
[null,null,null,null,null,null,null,null,null,null,null,null,null,null,null,"2017-12-12",null,null,null,null,null,null,null,null,null,null,72.099999999999795,"SATISFACTORIO"]
[null,null,null,null,null,null,null,null,null,null,null,null,null,null,null,"2017-12-13",null,null,null,null,null,null,null,null,null,null,72.199999999999804,"SATISFACTORIO"]
[null,null,null,null,null,null,null,null,null,null,null,null,null,null,null,"2017-12-14",null,null,null,null,null,null,null,null,null,null,72.299999999999798,"SATISFACTORIO"]
[null,null,null,null,null,null,null,null,null,null,null,null,null,null,null,"2017-12-15",null,null,null,null,null,null,null,null,null,null,72.399999999999807,"SATISFACTORIO"]
[null,null,null,null,null,null,null,null,null,null,null,null,null,null,null,"2017-12-16",null,null,null,null,null,null,null,null,null,null,72.499999999999801,"SATISFACTORIO"]
[null,null,null,null,null,null,null,null,null,null,null,null,null,null,null,"2017-12-17",null,null,null,null,null,null,null,null,null,null,72.599999999999795,"SATISFACTORIO"]
[null,null,null,null,null,null,null,null,null,null,null,null,null,null,null,"2017-12-18",null,null,null,null,null,null,null,null,null,null,72.699999999999804,"SATISFACTORIO"]
[null,null,null,null,null,null,null,null,null,null,null,null,null,null,null,"2017-12-19",null,null,null,null,null,null,null,null,null,null,72.799999999999798,"SATISFACTORIO"]
[null,null,null,null,null,null,null,null,null,null,null,null,null,null,null,"2017-12-20",null,null,null,null,null,null,null,null,null,null,72.899999999999807,"SATISFACTORIO"]
[null,null,null,null,null,null,null,null,null,null,null,null,null,null,null,"2017-12-21",null,null,null,null,null,null,null,null,null,null,72.999999999999801,"SATISFACTORIO"]
[null,null,null,null,null,null,null,null,null,null,null,null,null,null,null,"2017-12-22",null,null,null,null,null,null,null,null,null,null,73.099999999999795,"SATISFACTORIO"]
[null,null,null,null,null,null,null,null,null,null,null,null,null,null,null,"2017-12-23",null,null,null,null,null,null,null,null,null,null,73.199999999999804,"SATISFACTORIO"]
[null,null,null,null,null,null,null,null,null,null,null,null,null,null,null,"2017-12-24",null,null,null,null,null,null,null,null,null,null,73.299999999999798,"SATISFACTORIO"]
[null,null,null,null,null,null,null,null,null,null,null,null,null,null,null,"2017-12-25",null,null,null,null,null,null,null,null,null,null,73.399999999999807,"SATISFACTORIO"]
[null,null,null,null,null,null,null,null,null,null,null,null,null,null,null,"2017-12-26",null,null,null,null,null,null,null,null,null,null,73.499999999999801,"SATISFACTORIO"]
[null,null,null,null,null,null,null,null,null,null,null,null,null,null,null,"2017-12-27",null,null,null,null,null,null,null,null,null,null,73.599999999999795,"SATISFACTORIO"]
[null,null,null,null,null,null,null,null,null,null,null,null,null,null,null,"2017-12-28",null,null,null,null,null,null,null,null,null,null,73.699999999999804,"SATISFACTORIO"]
[null,null,null,null,null,null,null,null,null,null,null,null,null,null,null,"2017-12-29",null,null,null,null,null,null,null,null,null,null,73.799999999999798,"SATISFACTORIO"]
[null,null,null,null,null,null,null,null,null,null,null,null,null,null,null,"2017-12-30",null,null,null,null,null,null,null,null,null,null,73.899999999999807,"SATISFACTORIO"]
[null,null,null,null,null,null,null,null,null,null,null,null,null,null,null,"2017-12-31",null,null,null,null,null,null,null,null,null,null,73.999999999999801,"SATISFACTORIO"]
[null,null,null,null,null,null,null,null,null,null,null,null,null,null,null,"2018-01-01",null,null,null,null,null,null,null,null,null,null,74.099999999999795,"SATISFACTORIO"]
[null,null,null,null,null,null,null,null,null,null,null,null,null,null,null,"2018-01-02",null,null,null,null,null,null,null,null,null,null,74.199999999999804,"SATISFACTORIO"]
[null,null,null,null,null,null,null,null,null,null,null,null,null,null,null,"2018-01-03",null,null,null,null,null,null,null,null,null,null,74.299999999999798,"SATISFACTORIO"]
[null,null,null,null,null,null,null,null,null,null,null,null,null,null,null,"2018-01-04",null,null,null,null,null,null,null,null,null,null,74.399999999999807,"SATISFACTORIO"]
[null,null,null,null,null,null,null,null,null,null,null,null,null,null,null,"2018-01-05",null,null,null,null,null,null,null,null,null,null,74.499999999999801,"SATISFACTORIO"]
[null,null,null,null,null,null,null,null,null,null,null,null,null,null,null,"2018-01-06",null,null,null,null,null,null,null,null,null,null,74.599999999999795,"SATISFACTORIO"]
[null,null,null,null,null,null,null,null,null,null,null,null,null,null,null,"2018-01-07",null,null,null,null,null,null,null,null,null,null,74.699999999999804,"SATISFACTORIO"]
[null,null,null,null,null,null,null,null,null,null,null,null,null,null,null,"2018-01-08",null,null,null,null,null,null,null,null,null,null,74.799999999999798,"SATISFACTORIO"]
[null,null,null,null,null,null,null,null,null,null,null,null,null,null,null,"2018-01-09",null,null,null,null,null,null,null,null,null,null,74.899999999999807,"SATISFACTORIO"]
[null,null,null,null,null,null,null,null,null,null,null,null,null,null,null,"2018-01-10",null,null,null,null,null,null,null,null,null,null,74.999999999999801,"SATISFACTORIO"]
[null,null,null,null,null,null,null,null,null,null,null,null,null,null,null,"2018-01-11",null,null,null,null,null,null,null,null,null,null,75.099999999999795,"SATISFACTORIO"]
[null,null,null,null,null,null,null,null,null,null,null,null,null,null,null,"2018-01-12",null,null,null,null,null,null,null,null,null,null,75.199999999999804,"SATISFACTORIO"]
[null,null,null,null,null,null,null,null,null,null,null,null,null,null,null,"2018-01-13",null,null,null,null,null,null,null,null,null,null,75.299999999999798,"SATISFACTORIO"]
[null,null,null,null,null,null,null,null,null,null,null,null,null,null,null,"2018-01-14",null,null,null,null,null,null,null,null,null,null,75.399999999999807,"SATISFACTORIO"]
[null,null,null,null,null,null,null,null,null,null,null,null,null,null,null,"2018-01-15",null,null,null,null,null,null,null,null,null,null,75.499999999999801,"SATISFACTORIO"]
[null,null,null,null,null,null,null,null,null,null,null,null,null,null,null,"2018-01-16",null,null,null,null,null,null,null,null,null,null,75.599999999999795,"SATISFACTORIO"]
[null,null,null,null,null,null,null,null,null,null,null,null,null,null,null,"2018-01-17",null,null,null,null,null,null,null,null,null,null,75.699999999999804,"SATISFACTORIO"]
[null,null,null,null,null,null,null,null,null,null,null,null,null,null,null,"2018-01-18",null,null,null,null,null,null,null,null,null,null,75.799999999999798,"SATISFACTORIO"]
[null,null,null,null,null,null,null,null,null,null,null,null,null,null,null,"2018-01-19",null,null,null,null,null,null,null,null,null,null,75.899999999999807,"SATISFACTORIO"]
[null,null,null,null,null,null,null,null,null,null,null,null,null,null,null,"2018-01-20",null,null,null,null,null,null,null,null,null,null,75.999999999999801,"SATISFACTORIO"]
[null,null,null,null,null,null,null,null,null,null,null,null,null,null,null,"2018-01-21",null,null,null,null,null,null,null,null,null,null,76.099999999999795,"SATISFACTORIO"]
[null,null,null,null,null,null,null,null,null,null,null,null,null,null,null,"2018-01-22",null,null,null,null,null,null,null,null,null,null,76.199999999999804,"SATISFACTORIO"]
[null,null,null,null,null,null,null,null,null,null,null,null,null,null,null,"2018-01-23",null,null,null,null,null,null,null,null,null,null,76.299999999999798,"SATISFACTORIO"]
[null,null,null,null,null,null,null,null,null,null,null,null,null,null,null,"2018-01-24",null,null,null,null,null,null,null,null,null,null,76.399999999999807,"SATISFACTORIO"]
[null,null,null,null,null,null,null,null,null,null,null,null,null,null,null,"2018-01-25",null,null,null,null,null,null,null,null,null,null,76.499999999999801,"SATISFACTORIO"]
[null,null,null,null,null,null,null,null,null,null,null,null,null,null,null,"2018-01-26",null,null,null,null,null,null,null,null,null,null,76.599999999999795,"SATISFACTORIO"]
[null,null,null,null,null,null,null,null,null,null,null,null,null,null,null,"2018-01-27",null,null,null,null,null,null,null,null,null,null,76.699999999999804,"SATISFACTORIO"]
[null,null,null,null,null,null,null,null,null,null,null,null,null,null,null,"2018-01-28",null,null,null,null,null,null,null,null,null,null,76.799999999999798,"SATISFACTORIO"]
[null,null,null,null,null,null,null,null,null,null,null,null,null,null,null,"2018-01-29",null,null,null,null,null,null,null,null,null,null,76.899999999999807,"SATISFACTORIO"]
[null,null,null,null,null,null,null,null,null,null,null,null,null,null,null,"2018-01-30",null,null,null,null,null,null,null,null,null,null,76.999999999999801,"SATISFACTORIO"]
[null,null,null,null,null,null,null,null,null,null,null,null,null,null,null,"2018-01-31",null,null,null,null,null,null,null,null,null,null,77.099999999999795,"SATISFACTORIO"]
[null,null,null,null,null,null,null,null,null,null,null,null,null,null,null,"2018-02-01",null,null,null,null,null,null,null,null,null,null,77.199999999999804,"SATISFACTORIO"]
[null,null,null,null,null,null,null,null,null,null,null,null,null,null,null,"2018-02-02",null,null,null,null,null,null,null,null,null,null,77.299999999999798,"SATISFACTORIO"]
[null,null,null,null,null,null,null,null,null,null,null,null,null,null,null,"2018-02-03",null,null,null,null,null,null,null,null,null,null,77.399999999999807,"SATISFACTORIO"]
[null,null,null,null,null,null,null,null,null,null,null,null,null,null,null,"2018-02-04",null,null,null,null,null,null,null,null,null,null,77.499999999999801,"SATISFACTORIO"]
[null,null,null,null,null,null,null,null,null,null,null,null,null,null,null,"2018-02-05",null,null,null,null,null,null,null,null,null,null,77.599999999999795,"SATISFACTORIO"]
[null,null,null,null,null,null,null,null,null,null,null,null,null,null,null,"2018-02-06",null,null,null,null,null,null,null,null,null,null,77.699999999999804,"SATISFACTORIO"]
[null,null,null,null,null,null,null,null,null,null,null,null,null,null,null,"2018-02-07",null,null,null,null,null,null,null,null,null,null,77.799999999999798,"SATISFACTORIO"]
[null,null,null,null,null,null,null,null,null,null,null,null,null,null,null,"2018-02-08",null,null,null,null,null,null,null,null,null,null,77.899999999999807,"SATISFACTORIO"]
[null,null,null,null,null,null,null,null,null,null,null,null,null,null,null,"2018-02-09",null,null,null,null,null,null,null,null,null,null,77.999999999999801,"SATISFACTORIO"]
[null,null,null,null,null,null,null,null,null,null,null,null,null,null,null,"2018-02-10",null,null,null,null,null,null,null,null,null,null,78.099999999999795,"SATISFACTORIO"]
[null,null,null,null,null,null,null,null,null,null,null,null,null,null,null,"2018-02-11",null,null,null,null,null,null,null,null,null,null,78.199999999999804,"SATISFACTORIO"]
[null,null,null,null,null,null,null,null,null,null,null,null,null,null,null,"2018-02-12",null,null,null,null,null,null,null,null,null,null,78.299999999999798,"SATISFACTORIO"]
[null,null,null,null,null,null,null,null,null,null,null,null,null,null,null,"2018-02-13",null,null,null,null,null,null,null,null,null,null,78.399999999999807,"SATISFACTORIO"]
[null,null,null,null,null,null,null,null,null,null,null,null,null,null,null,"2018-02-14",null,null,null,null,null,null,null,null,null,null,78.499999999999801,"SATISFACTORIO"]
[null,null,null,null,null,null,null,null,null,null,null,null,null,null,null,"2018-02-15",null,null,null,null,null,null,null,null,null,null,78.599999999999795,"SATISFACTORIO"]
[null,null,null,null,null,null,null,null,null,null,null,null,null,null,null,"2018-02-16",null,null,null,null,null,null,null,null,null,null,78.699999999999804,"SATISFACTORIO"]
[null,null,null,null,null,null,null,null,null,null,null,null,null,null,null,"2018-02-17",null,null,null,null,null,null,null,null,null,null,78.799999999999798,"SATISFACTORIO"]
[null,null,null,null,null,null,null,null,null,null,null,null,null,null,null,"2018-02-18",null,null,null,null,null,null,null,null,null,null,78.899999999999693,"SATISFACTORIO"]
[null,null,null,null,null,null,null,null,null,null,null,null,null,null,null,"2018-02-19",null,null,null,null,null,null,null,null,null,null,78.999999999999801,"SATISFACTORIO"]
[null,null,null,null,null,null,null,null,null,null,null,null,null,null,null,"2018-02-20",null,null,null,null,null,null,null,null,null,null,79.099999999999795,"SATISFACTORIO"]
[null,null,null,null,null,null,null,null,null,null,null,null,null,null,null,"2018-02-21",null,null,null,null,null,null,null,null,null,null,79.199999999999804,"SATISFACTORIO"]
[null,null,null,null,null,null,null,null,null,null,null,null,null,null,null,"2018-02-22",null,null,null,null,null,null,null,null,null,null,79.299999999999798,"SATISFACTORIO"]
[null,null,null,null,null,null,null,null,null,null,null,null,null,null,null,"2018-02-23",null,null,null,null,null,null,null,null,null,null,79.399999999999693,"SATISFACTORIO"]
[null,null,null,null,null,null,null,null,null,null,null,null,null,null,null,"2018-02-24",null,null,null,null,null,null,null,null,null,null,79.499999999999801,"SATISFACTORIO"]
[null,null,null,null,null,null,null,null,null,null,null,null,null,null,null,"2018-02-25",null,null,null,null,null,null,null,null,null,null,79.599999999999795,"SATISFACTORIO"]
[null,null,null,null,null,null,null,null,null,null,null,null,null,null,null,"2018-02-26",null,null,null,null,null,null,null,null,null,null,79.699999999999804,"SATISFACTORIO"]
[null,null,null,null,null,null,null,null,null,null,null,null,null,null,null,"2018-02-27",null,null,null,null,null,null,null,null,null,null,79.799999999999798,"SATISFACTORIO"]
[null,null,null,null,null,null,null,null,null,null,null,null,null,null,null,"2018-02-28",null,null,null,null,null,null,null,null,null,null,79.899999999999693,"SATISFACTORIO"]
[null,null,null,null,null,null,null,null,null,null,null,null,null,null,null,"2018-03-01",null,null,null,null,null,null,null,null,null,null,79.999999999999801,"DESTACADO"]
[null,null,null,null,null,null,null,null,null,null,null,null,null,null,null,"2018-03-02",null,null,null,null,null,null,null,null,null,null,80.099999999999795,"DESTACADO"]
[null,null,null,null,null,null,null,null,null,null,null,null,null,null,null,"2018-03-03",null,null,null,null,null,null,null,null,null,null,80.199999999999704,"DESTACADO"]
[null,null,null,null,null,null,null,null,null,null,null,null,null,null,null,"2018-03-04",null,null,null,null,null,null,null,null,null,null,80.299999999999798,"DESTACADO"]
[null,null,null,null,null,null,null,null,null,null,null,null,null,null,null,"2018-03-05",null,null,null,null,null,null,null,null,null,null,80.399999999999693,"DESTACADO"]
[null,null,null,null,null,null,null,null,null,null,null,null,null,null,null,"2018-03-06",null,null,null,null,null,null,null,null,null,null,80.499999999999702,"DESTACADO"]
[null,null,null,null,null,null,null,null,null,null,null,null,null,null,null,"2018-03-07",null,null,null,null,null,null,null,null,null,null,80.599999999999795,"DESTACADO"]
[null,null,null,null,null,null,null,null,null,null,null,null,null,null,null,"2018-03-08",null,null,null,null,null,null,null,null,null,null,80.699999999999704,"DESTACADO"]
[null,null,null,null,null,null,null,null,null,null,null,null,null,null,null,"2018-03-09",null,null,null,null,null,null,null,null,null,null,80.799999999999798,"DESTACADO"]
[null,null,null,null,null,null,null,null,null,null,null,null,null,null,null,"2018-03-10",null,null,null,null,null,null,null,null,null,null,80.899999999999693,"DESTACADO"]
[null,null,null,null,null,null,null,null,null,null,null,null,null,null,null,"2018-03-11",null,null,null,null,null,null,null,null,null,null,80.999999999999702,"DESTACADO"]
[null,null,null,null,null,null,null,null,null,null,null,null,null,null,null,"2018-03-12",null,null,null,null,null,null,null,null,null,null,81.099999999999795,"DESTACADO"]
[null,null,null,null,null,null,null,null,null,null,null,null,null,null,null,"2018-03-13",null,null,null,null,null,null,null,null,null,null,81.199999999999704,"DESTACADO"]
[null,null,null,null,null,null,null,null,null,null,null,null,null,null,null,"2018-03-14",null,null,null,null,null,null,null,null,null,null,81.299999999999798,"DESTACADO"]
[null,null,null,null,null,null,null,null,null,null,null,null,null,null,null,"2018-03-15",null,null,null,null,null,null,null,null,null,null,81.399999999999693,"DESTACADO"]
[null,null,null,null,null,null,null,null,null,null,null,null,null,null,null,"2018-03-16",null,null,null,null,null,null,null,null,null,null,81.499999999999702,"DESTACADO"]
[null,null,null,null,null,null,null,null,null,null,null,null,null,null,null,"2018-03-17",null,null,null,null,null,null,null,null,null,null,81.599999999999795,"DESTACADO"]
[null,null,null,null,null,null,null,null,null,null,null,null,null,null,null,"2018-03-18",null,null,null,null,null,null,null,null,null,null,81.699999999999704,"DESTACADO"]
[null,null,null,null,null,null,null,null,null,null,null,null,null,null,null,"2018-03-19",null,null,null,null,null,null,null,null,null,null,81.799999999999699,"DESTACADO"]
[null,null,null,null,null,null,null,null,null,null,null,null,null,null,null,"2018-03-20",null,null,null,null,null,null,null,null,null,null,81.899999999999693,"DESTACADO"]
[null,null,null,null,null,null,null,null,null,null,null,null,null,null,null,"2018-03-21",null,null,null,null,null,null,null,null,null,null,81.999999999999702,"DESTACADO"]
[null,null,null,null,null,null,null,null,null,null,null,null,null,null,null,"2018-03-22",null,null,null,null,null,null,null,null,null,null,82.099999999999696,"DESTACADO"]
[null,null,null,null,null,null,null,null,null,null,null,null,null,null,null,"2018-03-23",null,null,null,null,null,null,null,null,null,null,82.199999999999704,"DESTACADO"]
[null,null,null,null,null,null,null,null,null,null,null,null,null,null,null,"2018-03-24",null,null,null,null,null,null,null,null,null,null,82.299999999999699,"DESTACADO"]
[null,null,null,null,null,null,null,null,null,null,null,null,null,null,null,"2018-03-25",null,null,null,null,null,null,null,null,null,null,82.399999999999693,"DESTACADO"]
[null,null,null,null,null,null,null,null,null,null,null,null,null,null,null,"2018-03-26",null,null,null,null,null,null,null,null,null,null,82.499999999999702,"DESTACADO"]
[null,null,null,null,null,null,null,null,null,null,null,null,null,null,null,"2018-03-27",null,null,null,null,null,null,null,null,null,null,82.599999999999696,"DESTACADO"]
[null,null,null,null,null,null,null,null,null,null,null,null,null,null,null,"2018-03-28",null,null,null,null,null,null,null,null,null,null,82.699999999999704,"DESTACADO"]
[null,null,null,null,null,null,null,null,null,null,null,null,null,null,null,"2018-03-29",null,null,null,null,null,null,null,null,null,null,82.799999999999699,"DESTACADO"]
[null,null,null,null,null,null,null,null,null,null,null,null,null,null,null,"2018-03-30",null,null,null,null,null,null,null,null,null,null,82.899999999999693,"DESTACADO"]
[null,null,null,null,null,null,null,null,null,null,null,null,null,null,null,"2018-03-31",null,null,null,null,null,null,null,null,null,null,82.999999999999702,"DESTACADO"]
[null,null,null,null,null,null,null,null,null,null,null,null,null,null,null,"2018-04-01",null,null,null,null,null,null,null,null,null,null,83.099999999999696,"DESTACADO"]
[null,null,null,null,null,null,null,null,null,null,null,null,null,null,null,"2018-04-02",null,null,null,null,null,null,null,null,null,null,83.199999999999704,"DESTACADO"]
[null,null,null,null,null,null,null,null,null,null,null,null,null,null,null,"2018-04-03",null,null,null,null,null,null,null,null,null,null,83.299999999999699,"DESTACADO"]
[null,null,null,null,null,null,null,null,null,null,null,null,null,null,null,"2018-04-04",null,null,null,null,null,null,null,null,null,null,83.399999999999693,"DESTACADO"]
[null,null,null,null,null,null,null,null,null,null,null,null,null,null,null,"2018-04-05",null,null,null,null,null,null,null,null,null,null,83.499999999999702,"DESTACADO"]
[null,null,null,null,null,null,null,null,null,null,null,null,null,null,null,"2018-04-06",null,null,null,null,null,null,null,null,null,null,83.599999999999696,"DESTACADO"]
[null,null,null,null,null,null,null,null,null,null,null,null,null,null,null,"2018-04-07",null,null,null,null,null,null,null,null,null,null,83.699999999999704,"DESTACADO"]
[null,null,null,null,null,null,null,null,null,null,null,null,null,null,null,"2018-04-08",null,null,null,null,null,null,null,null,null,null,83.799999999999699,"DESTACADO"]
[null,null,null,null,null,null,null,null,null,null,null,null,null,null,null,"2018-04-09",null,null,null,null,null,null,null,null,null,null,83.899999999999693,"DESTACADO"]
[null,null,null,null,null,null,null,null,null,null,null,null,null,null,null,"2018-04-10",null,null,null,null,null,null,null,null,null,null,83.999999999999702,"DESTACADO"]
[null,null,null,null,null,null,null,null,null,null,null,null,null,null,null,"2018-04-11",null,null,null,null,null,null,null,null,null,null,84.099999999999696,"DESTACADO"]
[null,null,null,null,null,null,null,null,null,null,null,null,null,null,null,"2018-04-12",null,null,null,null,null,null,null,null,null,null,84.199999999999704,"DESTACADO"]
[null,null,null,null,null,null,null,null,null,null,null,null,null,null,null,"2018-04-13",null,null,null,null,null,null,null,null,null,null,84.299999999999699,"DESTACADO"]
[null,null,null,null,null,null,null,null,null,null,null,null,null,null,null,"2018-04-14",null,null,null,null,null,null,null,null,null,null,84.399999999999693,"DESTACADO"]
[null,null,null,null,null,null,null,null,null,null,null,null,null,null,null,"2018-04-15",null,null,null,null,null,null,null,null,null,null,84.499999999999702,"DESTACADO"]
[null,null,null,null,null,null,null,null,null,null,null,null,null,null,null,"2018-04-16",null,null,null,null,null,null,null,null,null,null,84.599999999999696,"DESTACADO"]
[null,null,null,null,null,null,null,null,null,null,null,null,null,null,null,"2018-04-17",null,null,null,null,null,null,null,null,null,null,84.699999999999704,"DESTACADO"]
[null,null,null,null,null,null,null,null,null,null,null,null,null,null,null,"2018-04-18",null,null,null,null,null,null,null,null,null,null,84.799999999999699,"DESTACADO"]
[null,null,null,null,null,null,null,null,null,null,null,null,null,null,null,"2018-04-19",null,null,null,null,null,null,null,null,null,null,84.899999999999693,"DESTACADO"]
[null,null,null,null,null,null,null,null,null,null,null,null,null,null,null,"2018-04-20",null,null,null,null,null,null,null,null,null,null,84.999999999999702,"DESTACADO"]
[null,null,null,null,null,null,null,null,null,null,null,null,null,null,null,"2018-04-21",null,null,null,null,null,null,null,null,null,null,85.099999999999696,"DESTACADO"]
[null,null,null,null,null,null,null,null,null,null,null,null,null,null,null,"2018-04-22",null,null,null,null,null,null,null,null,null,null,85.199999999999704,"DESTACADO"]
[null,null,null,null,null,null,null,null,null,null,null,null,null,null,null,"2018-04-23",null,null,null,null,null,null,null,null,null,null,85.299999999999699,"DESTACADO"]
[null,null,null,null,null,null,null,null,null,null,null,null,null,null,null,"2018-04-24",null,null,null,null,null,null,null,null,null,null,85.399999999999693,"DESTACADO"]
[null,null,null,null,null,null,null,null,null,null,null,null,null,null,null,"2018-04-25",null,null,null,null,null,null,null,null,null,null,85.499999999999702,"DESTACADO"]
[null,null,null,null,null,null,null,null,null,null,null,null,null,null,null,"2018-04-26",null,null,null,null,null,null,null,null,null,null,85.599999999999696,"DESTACADO"]
[null,null,null,null,null,null,null,null,null,null,null,null,null,null,null,"2018-04-27",null,null,null,null,null,null,null,null,null,null,85.699999999999704,"DESTACADO"]
[null,null,null,null,null,null,null,null,null,null,null,null,null,null,null,"2018-04-28",null,null,null,null,null,null,null,null,null,null,85.799999999999699,"DESTACADO"]
[null,null,null,null,null,null,null,null,null,null,null,null,null,null,null,"2018-04-29",null,null,null,null,null,null,null,null,null,null,85.899999999999693,"DESTACADO"]
[null,null,null,null,null,null,null,null,null,null,null,null,null,null,null,"2018-04-30",null,null,null,null,null,null,null,null,null,null,85.999999999999702,"DESTACADO"]
[null,null,null,null,null,null,null,null,null,null,null,null,null,null,null,"2018-05-01",null,null,null,null,null,null,null,null,null,null,86.099999999999696,"DESTACADO"]
[null,null,null,null,null,null,null,null,null,null,null,null,null,null,null,"2018-05-02",null,null,null,null,null,null,null,null,null,null,86.199999999999704,"DESTACADO"]
[null,null,null,null,null,null,null,null,null,null,null,null,null,null,null,"2018-05-03",null,null,null,null,null,null,null,null,null,null,86.299999999999699,"DESTACADO"]
[null,null,null,null,null,null,null,null,null,null,null,null,null,null,null,"2018-05-04",null,null,null,null,null,null,null,null,null,null,86.399999999999693,"DESTACADO"]
[null,null,null,null,null,null,null,null,null,null,null,null,null,null,null,"2018-05-05",null,null,null,null,null,null,null,null,null,null,86.499999999999702,"DESTACADO"]
[null,null,null,null,null,null,null,null,null,null,null,null,null,null,null,"2018-05-06",null,null,null,null,null,null,null,null,null,null,86.599999999999696,"DESTACADO"]
[null,null,null,null,null,null,null,null,null,null,null,null,null,null,null,"2018-05-07",null,null,null,null,null,null,null,null,null,null,86.699999999999704,"DESTACADO"]
[null,null,null,null,null,null,null,null,null,null,null,null,null,null,null,"2018-05-08",null,null,null,null,null,null,null,null,null,null,86.799999999999699,"DESTACADO"]
[null,null,null,null,null,null,null,null,null,null,null,null,null,null,null,"2018-05-09",null,null,null,null,null,null,null,null,null,null,86.899999999999693,"DESTACADO"]
[null,null,null,null,null,null,null,null,null,null,null,null,null,null,null,"2018-05-10",null,null,null,null,null,null,null,null,null,null,86.999999999999702,"DESTACADO"]
[null,null,null,null,null,null,null,null,null,null,null,null,null,null,null,"2018-05-11",null,null,null,null,null,null,null,null,null,null,87.099999999999696,"DESTACADO"]
[null,null,null,null,null,null,null,null,null,null,null,null,null,null,null,"2018-05-12",null,null,null,null,null,null,null,null,null,null,87.199999999999704,"DESTACADO"]
[null,null,null,null,null,null,null,null,null,null,null,null,null,null,null,"2018-05-13",null,null,null,null,null,null,null,null,null,null,87.299999999999699,"DESTACADO"]
[null,null,null,null,null,null,null,null,null,null,null,null,null,null,null,"2018-05-14",null,null,null,null,null,null,null,null,null,null,87.399999999999693,"DESTACADO"]
[null,null,null,null,null,null,null,null,null,null,null,null,null,null,null,"2018-05-15",null,null,null,null,null,null,null,null,null,null,87.499999999999702,"DESTACADO"]
[null,null,null,null,null,null,null,null,null,null,null,null,null,null,null,"2018-05-16",null,null,null,null,null,null,null,null,null,null,87.599999999999696,"DESTACADO"]
[null,null,null,null,null,null,null,null,null,null,null,null,null,null,null,"2018-05-17",null,null,null,null,null,null,null,null,null,null,87.699999999999704,"DESTACADO"]
[null,null,null,null,null,null,null,null,null,null,null,null,null,null,null,"2018-05-18",null,null,null,null,null,null,null,null,null,null,87.799999999999699,"DESTACADO"]
[null,null,null,null,null,null,null,null,null,null,null,null,null,null,null,"2018-05-19",null,null,null,null,null,null,null,null,null,null,87.899999999999693,"DESTACADO"]
[null,null,null,null,null,null,null,null,null,null,null,null,null,null,null,"2018-05-20",null,null,null,null,null,null,null,null,null,null,87.999999999999702,"DESTACADO"]
[null,null,null,null,null,null,null,null,null,null,null,null,null,null,null,"2018-05-21",null,null,null,null,null,null,null,null,null,null,88.099999999999696,"DESTACADO"]
[null,null,null,null,null,null,null,null,null,null,null,null,null,null,null,"2018-05-22",null,null,null,null,null,null,null,null,null,null,88.199999999999704,"DESTACADO"]
[null,null,null,null,null,null,null,null,null,null,null,null,null,null,null,"2018-05-23",null,null,null,null,null,null,null,null,null,null,88.299999999999699,"DESTACADO"]
[null,null,null,null,null,null,null,null,null,null,null,null,null,null,null,"2018-05-24",null,null,null,null,null,null,null,null,null,null,88.399999999999693,"DESTACADO"]
[null,null,null,null,null,null,null,null,null,null,null,null,null,null,null,"2018-05-25",null,null,null,null,null,null,null,null,null,null,88.499999999999702,"DESTACADO"]
[null,null,null,null,null,null,null,null,null,null,null,null,null,null,null,"2018-05-26",null,null,null,null,null,null,null,null,null,null,88.599999999999696,"DESTACADO"]
[null,null,null,null,null,null,null,null,null,null,null,null,null,null,null,"2018-05-27",null,null,null,null,null,null,null,null,null,null,88.699999999999704,"DESTACADO"]
[null,null,null,null,null,null,null,null,null,null,null,null,null,null,null,"2018-05-28",null,null,null,null,null,null,null,null,null,null,88.799999999999699,"DESTACADO"]
[null,null,null,null,null,null,null,null,null,null,null,null,null,null,null,"2018-05-29",null,null,null,null,null,null,null,null,null,null,88.899999999999693,"DESTACADO"]
[null,null,null,null,null,null,null,null,null,null,null,null,null,null,null,"2018-05-30",null,null,null,null,null,null,null,null,null,null,88.999999999999702,"DESTACADO"]
[null,null,null,null,null,null,null,null,null,null,null,null,null,null,null,"2018-05-31",null,null,null,null,null,null,null,null,null,null,89.099999999999696,"DESTACADO"]
[null,null,null,null,null,null,null,null,null,null,null,null,null,null,null,"2018-06-01",null,null,null,null,null,null,null,null,null,null,89.199999999999704,"DESTACADO"]
[null,null,null,null,null,null,null,null,null,null,null,null,null,null,null,"2018-06-02",null,null,null,null,null,null,null,null,null,null,89.299999999999699,"DESTACADO"]
[null,null,null,null,null,null,null,null,null,null,null,null,null,null,null,"2018-06-03",null,null,null,null,null,null,null,null,null,null,89.399999999999693,"DESTACADO"]
[null,null,null,null,null,null,null,null,null,null,null,null,null,null,null,"2018-06-04",null,null,null,null,null,null,null,null,null,null,89.499999999999702,"DESTACADO"]
[null,null,null,null,null,null,null,null,null,null,null,null,null,null,null,"2018-06-05",null,null,null,null,null,null,null,null,null,null,89.599999999999696,"DESTACADO"]
[null,null,null,null,null,null,null,null,null,null,null,null,null,null,null,"2018-06-06",null,null,null,null,null,null,null,null,null,null,89.699999999999704,"DESTACADO"]
[null,null,null,null,null,null,null,null,null,null,null,null,null,null,null,"2018-06-07",null,null,null,null,null,null,null,null,null,null,89.799999999999699,"DESTACADO"]
[null,null,null,null,null,null,null,null,null,null,null,null,null,null,null,"2018-06-08",null,null,null,null,null,null,null,null,null,null,89.899999999999693,"DESTACADO"]
[null,null,null,null,null,null,null,null,null,null,null,null,null,null,null,"2018-06-09",null,null,null,null,null,null,null,null,null,null,89.999999999999702,"DESTACADO"]
[null,null,null,null,null,null,null,null,null,null,null,null,null,null,null,"2018-06-10",null,null,null,null,null,null,null,null,null,null,90.099999999999696,"DESTACADO"]
[null,null,null,null,null,null,null,null,null,null,null,null,null,null,null,"2018-06-11",null,null,null,null,null,null,null,null,null,null,90.199999999999704,"DESTACADO"]
[null,null,null,null,null,null,null,null,null,null,null,null,null,null,null,"2018-06-12",null,null,null,null,null,null,null,null,null,null,90.299999999999699,"DESTACADO"]
[null,null,null,null,null,null,null,null,null,null,null,null,null,null,null,"2018-06-13",null,null,null,null,null,null,null,null,null,null,90.399999999999693,"DESTACADO"]
[null,null,null,null,null,null,null,null,null,null,null,null,null,null,null,"2018-06-14",null,null,null,null,null,null,null,null,null,null,90.499999999999702,"DESTACADO"]
[null,null,null,null,null,null,null,null,null,null,null,null,null,null,null,"2018-06-15",null,null,null,null,null,null,null,null,null,null,90.599999999999696,"DESTACADO"]
[null,null,null,null,null,null,null,null,null,null,null,null,null,null,null,"2018-06-16",null,null,null,null,null,null,null,null,null,null,90.699999999999704,"DESTACADO"]
[null,null,null,null,null,null,null,null,null,null,null,null,null,null,null,"2018-06-17",null,null,null,null,null,null,null,null,null,null,90.799999999999699,"DESTACADO"]
[null,null,null,null,null,null,null,null,null,null,null,null,null,null,null,"2018-06-18",null,null,null,null,null,null,null,null,null,null,90.899999999999693,"DESTACADO"]
[null,null,null,null,null,null,null,null,null,null,null,null,null,null,null,"2018-06-19",null,null,null,null,null,null,null,null,null,null,90.999999999999702,"DESTACADO"]
[null,null,null,null,null,null,null,null,null,null,null,null,null,null,null,"2018-06-20",null,null,null,null,null,null,null,null,null,null,91.099999999999696,"DESTACADO"]
[null,null,null,null,null,null,null,null,null,null,null,null,null,null,null,"2018-06-21",null,null,null,null,null,null,null,null,null,null,91.199999999999704,"DESTACADO"]
[null,null,null,null,null,null,null,null,null,null,null,null,null,null,null,"2018-06-22",null,null,null,null,null,null,null,null,null,null,91.299999999999699,"DESTACADO"]
[null,null,null,null,null,null,null,null,null,null,null,null,null,null,null,"2018-06-23",null,null,null,null,null,null,null,null,null,null,91.399999999999693,"DESTACADO"]
[null,null,null,null,null,null,null,null,null,null,null,null,null,null,null,"2018-06-24",null,null,null,null,null,null,null,null,null,null,91.499999999999702,"DESTACADO"]
[null,null,null,null,null,null,null,null,null,null,null,null,null,null,null,"2018-06-25",null,null,null,null,null,null,null,null,null,null,91.599999999999696,"DESTACADO"]
[null,null,null,null,null,null,null,null,null,null,null,null,null,null,null,"2018-06-26",null,null,null,null,null,null,null,null,null,null,91.699999999999704,"DESTACADO"]
[null,null,null,null,null,null,null,null,null,null,null,null,null,null,null,"2018-06-27",null,null,null,null,null,null,null,null,null,null,91.799999999999699,"DESTACADO"]
[null,null,null,null,null,null,null,null,null,null,null,null,null,null,null,"2018-06-28",null,null,null,null,null,null,null,null,null,null,91.899999999999693,"DESTACADO"]
[null,null,null,null,null,null,null,null,null,null,null,null,null,null,null,"2018-06-29",null,null,null,null,null,null,null,null,null,null,91.999999999999702,"DESTACADO"]
[null,null,null,null,null,null,null,null,null,null,null,null,null,null,null,"2018-06-30",null,null,null,null,null,null,null,null,null,null,92.099999999999696,"DESTACADO"]
[null,null,null,null,null,null,null,null,null,null,null,null,null,null,null,"2018-07-01",null,null,null,null,null,null,null,null,null,null,92.199999999999704,"DESTACADO"]
[null,null,null,null,null,null,null,null,null,null,null,null,null,null,null,"2018-07-02",null,null,null,null,null,null,null,null,null,null,92.299999999999699,"DESTACADO"]
[null,null,null,null,null,null,null,null,null,null,null,null,null,null,null,"2018-07-03",null,null,null,null,null,null,null,null,null,null,92.399999999999693,"DESTACADO"]
[null,null,null,null,null,null,null,null,null,null,null,null,null,null,null,"2018-07-04",null,null,null,null,null,null,null,null,null,null,92.499999999999702,"DESTACADO"]
[null,null,null,null,null,null,null,null,null,null,null,null,null,null,null,"2018-07-05",null,null,null,null,null,null,null,null,null,null,92.599999999999696,"DESTACADO"]
[null,null,null,null,null,null,null,null,null,null,null,null,null,null,null,"2018-07-06",null,null,null,null,null,null,null,null,null,null,92.699999999999704,"DESTACADO"]
[null,null,null,null,null,null,null,null,null,null,null,null,null,null,null,"2018-07-07",null,null,null,null,null,null,null,null,null,null,92.799999999999699,"DESTACADO"]
[null,null,null,null,null,null,null,null,null,null,null,null,null,null,null,"2018-07-08",null,null,null,null,null,null,null,null,null,null,92.899999999999693,"DESTACADO"]
[null,null,null,null,null,null,null,null,null,null,null,null,null,null,null,"2018-07-09",null,null,null,null,null,null,null,null,null,null,92.999999999999702,"DESTACADO"]
[null,null,null,null,null,null,null,null,null,null,null,null,null,null,null,"2018-07-10",null,null,null,null,null,null,null,null,null,null,93.099999999999696,"DESTACADO"]
[null,null,null,null,null,null,null,null,null,null,null,null,null,null,null,"2018-07-11",null,null,null,null,null,null,null,null,null,null,93.199999999999704,"DESTACADO"]
[null,null,null,null,null,null,null,null,null,null,null,null,null,null,null,"2018-07-12",null,null,null,null,null,null,null,null,null,null,93.299999999999699,"DESTACADO"]
[null,null,null,null,null,null,null,null,null,null,null,null,null,null,null,"2018-07-13",null,null,null,null,null,null,null,null,null,null,93.399999999999693,"DESTACADO"]
[null,null,null,null,null,null,null,null,null,null,null,null,null,null,null,"2018-07-14",null,null,null,null,null,null,null,null,null,null,93.499999999999702,"DESTACADO"]
[null,null,null,null,null,null,null,null,null,null,null,null,null,null,null,"2018-07-15",null,null,null,null,null,null,null,null,null,null,93.599999999999696,"DESTACADO"]
[null,null,null,null,null,null,null,null,null,null,null,null,null,null,null,"2018-07-16",null,null,null,null,null,null,null,null,null,null,93.699999999999704,"DESTACADO"]
[null,null,null,null,null,null,null,null,null,null,null,null,null,null,null,"2018-07-17",null,null,null,null,null,null,null,null,null,null,93.799999999999699,"DESTACADO"]
[null,null,null,null,null,null,null,null,null,null,null,null,null,null,null,"2018-07-18",null,null,null,null,null,null,null,null,null,null,93.899999999999693,"DESTACADO"]
[null,null,null,null,null,null,null,null,null,null,null,null,null,null,null,"2018-07-19",null,null,null,null,null,null,null,null,null,null,93.999999999999702,"DESTACADO"]
[null,null,null,null,null,null,null,null,null,null,null,null,null,null,null,"2018-07-20",null,null,null,null,null,null,null,null,null,null,94.099999999999696,"DESTACADO"]
[null,null,null,null,null,null,null,null,null,null,null,null,null,null,null,"2018-07-21",null,null,null,null,null,null,null,null,null,null,94.199999999999704,"DESTACADO"]
[null,null,null,null,null,null,null,null,null,null,null,null,null,null,null,"2018-07-22",null,null,null,null,null,null,null,null,null,null,94.299999999999699,"DESTACADO"]
[null,null,null,null,null,null,null,null,null,null,null,null,null,null,null,"2018-07-23",null,null,null,null,null,null,null,null,null,null,94.399999999999693,"DESTACADO"]
[null,null,null,null,null,null,null,null,null,null,null,null,null,null,null,"2018-07-24",null,null,null,null,null,null,null,null,null,null,94.499999999999702,"DESTACADO"]
[null,null,null,null,null,null,null,null,null,null,null,null,null,null,null,"2018-07-25",null,null,null,null,null,null,null,null,null,null,94.599999999999696,"DESTACADO"]
[null,null,null,null,null,null,null,null,null,null,null,null,null,null,null,"2018-07-26",null,null,null,null,null,null,null,null,null,null,94.699999999999704,"DESTACADO"]
[null,null,null,null,null,null,null,null,null,null,null,null,null,null,null,"2018-07-27",null,null,null,null,null,null,null,null,null,null,94.799999999999699,"DESTACADO"]
[null,null,null,null,null,null,null,null,null,null,null,null,null,null,null,"2018-07-28",null,null,null,null,null,null,null,null,null,null,94.899999999999693,"DESTACADO"]
[null,null,null,null,null,null,null,null,null,null,null,null,null,null,null,"2018-07-29",null,null,null,null,null,null,null,null,null,null,94.999999999999702,"SOBRESALIENTE"]
[null,null,null,null,null,null,null,null,null,null,null,null,null,null,null,"2018-07-30",null,null,null,null,null,null,null,null,null,null,95.099999999999696,"SOBRESALIENTE"]
[null,null,null,null,null,null,null,null,null,null,null,null,null,null,null,"2018-07-31",null,null,null,null,null,null,null,null,null,null,95.199999999999704,"SOBRESALIENTE"]
[null,null,null,null,null,null,null,null,null,null,null,null,null,null,null,"2018-08-01",null,null,null,null,null,null,null,null,null,null,95.299999999999699,"SOBRESALIENTE"]
[null,null,null,null,null,null,null,null,null,null,null,null,null,null,null,"2018-08-02",null,null,null,null,null,null,null,null,null,null,95.399999999999693,"SOBRESALIENTE"]
[null,null,null,null,null,null,null,null,null,null,null,null,null,null,null,"2018-08-03",null,null,null,null,null,null,null,null,null,null,95.499999999999702,"SOBRESALIENTE"]
[null,null,null,null,null,null,null,null,null,null,null,null,null,null,null,"2018-08-04",null,null,null,null,null,null,null,null,null,null,95.599999999999696,"SOBRESALIENTE"]
[null,null,null,null,null,null,null,null,null,null,null,null,null,null,null,"2018-08-05",null,null,null,null,null,null,null,null,null,null,95.699999999999704,"SOBRESALIENTE"]
[null,null,null,null,null,null,null,null,null,null,null,null,null,null,null,"2018-08-06",null,null,null,null,null,null,null,null,null,null,95.799999999999699,"SOBRESALIENTE"]
[null,null,null,null,null,null,null,null,null,null,null,null,null,null,null,"2018-08-07",null,null,null,null,null,null,null,null,null,null,95.899999999999693,"SOBRESALIENTE"]
[null,null,null,null,null,null,null,null,null,null,null,null,null,null,null,"2018-08-08",null,null,null,null,null,null,null,null,null,null,95.999999999999702,"SOBRESALIENTE"]
[null,null,null,null,null,null,null,null,null,null,null,null,null,null,null,"2018-08-09",null,null,null,null,null,null,null,null,null,null,96.099999999999696,"SOBRESALIENTE"]
[null,null,null,null,null,null,null,null,null,null,null,null,null,null,null,"2018-08-10",null,null,null,null,null,null,null,null,null,null,96.199999999999704,"SOBRESALIENTE"]
[null,null,null,null,null,null,null,null,null,null,null,null,null,null,null,"2018-08-11",null,null,null,null,null,null,null,null,null,null,96.299999999999699,"SOBRESALIENTE"]
[null,null,null,null,null,null,null,null,null,null,null,null,null,null,null,"2018-08-12",null,null,null,null,null,null,null,null,null,null,96.399999999999693,"SOBRESALIENTE"]
[null,null,null,null,null,null,null,null,null,null,null,null,null,null,null,"2018-08-13",null,null,null,null,null,null,null,null,null,null,96.499999999999702,"SOBRESALIENTE"]
[null,null,null,null,null,null,null,null,null,null,null,null,null,null,null,"2018-08-14",null,null,null,null,null,null,null,null,null,null,96.599999999999696,"SOBRESALIENTE"]
[null,null,null,null,null,null,null,null,null,null,null,null,null,null,null,"2018-08-15",null,null,null,null,null,null,null,null,null,null,96.699999999999704,"SOBRESALIENTE"]
[null,null,null,null,null,null,null,null,null,null,null,null,null,null,null,"2018-08-16",null,null,null,null,null,null,null,null,null,null,96.799999999999699,"SOBRESALIENTE"]
[null,null,null,null,null,null,null,null,null,null,null,null,null,null,null,"2018-08-17",null,null,null,null,null,null,null,null,null,null,96.899999999999693,"SOBRESALIENTE"]
[null,null,null,null,null,null,null,null,null,null,null,null,null,null,null,"2018-08-18",null,null,null,null,null,null,null,null,null,null,96.999999999999702,"SOBRESALIENTE"]
[null,null,null,null,null,null,null,null,null,null,null,null,null,null,null,"2018-08-19",null,null,null,null,null,null,null,null,null,null,97.099999999999696,"SOBRESALIENTE"]
[null,null,null,null,null,null,null,null,null,null,null,null,null,null,null,"2018-08-20",null,null,null,null,null,null,null,null,null,null,97.199999999999704,"SOBRESALIENTE"]
[null,null,null,null,null,null,null,null,null,null,null,null,null,null,null,"2018-08-21",null,null,null,null,null,null,null,null,null,null,97.299999999999699,"SOBRESALIENTE"]
[null,null,null,null,null,null,null,null,null,null,null,null,null,null,null,"2018-08-22",null,null,null,null,null,null,null,null,null,null,97.399999999999693,"SOBRESALIENTE"]
[null,null,null,null,null,null,null,null,null,null,null,null,null,null,null,"2018-08-23",null,null,null,null,null,null,null,null,null,null,97.499999999999702,"SOBRESALIENTE"]
[null,null,null,null,null,null,null,null,null,null,null,null,null,null,null,"2018-08-24",null,null,null,null,null,null,null,null,null,null,97.599999999999696,"SOBRESALIENTE"]
[null,null,null,null,null,null,null,null,null,null,null,null,null,null,null,"2018-08-25",null,null,null,null,null,null,null,null,null,null,97.699999999999704,"SOBRESALIENTE"]
[null,null,null,null,null,null,null,null,null,null,null,null,null,null,null,"2018-08-26",null,null,null,null,null,null,null,null,null,null,97.799999999999699,"SOBRESALIENTE"]
[null,null,null,null,null,null,null,null,null,null,null,null,null,null,null,"2018-08-27",null,null,null,null,null,null,null,null,null,null,97.899999999999693,"SOBRESALIENTE"]
[null,null,null,null,null,null,null,null,null,null,null,null,null,null,null,"2018-08-28",null,null,null,null,null,null,null,null,null,null,97.999999999999702,"SOBRESALIENTE"]
[null,null,null,null,null,null,null,null,null,null,null,null,null,null,null,"2018-08-29",null,null,null,null,null,null,null,null,null,null,98.099999999999696,"SOBRESALIENTE"]
[null,null,null,null,null,null,null,null,null,null,null,null,null,null,null,"2018-08-30",null,null,null,null,null,null,null,null,null,null,98.199999999999704,"SOBRESALIENTE"]
[null,null,null,null,null,null,null,null,null,null,null,null,null,null,null,"2018-08-31",null,null,null,null,null,null,null,null,null,null,98.299999999999699,"SOBRESALIENTE"]
[null,null,null,null,null,null,null,null,null,null,null,null,null,null,null,"2018-09-01",null,null,null,null,null,null,null,null,null,null,98.399999999999693,"SOBRESALIENTE"]
[null,null,null,null,null,null,null,null,null,null,null,null,null,null,null,"2018-09-02",null,null,null,null,null,null,null,null,null,null,98.499999999999702,"SOBRESALIENTE"]
[null,null,null,null,null,null,null,null,null,null,null,null,null,null,null,"2018-09-03",null,null,null,null,null,null,null,null,null,null,98.599999999999696,"SOBRESALIENTE"]
[null,null,null,null,null,null,null,null,null,null,null,null,null,null,null,"2018-09-04",null,null,null,null,null,null,null,null,null,null,98.699999999999704,"SOBRESALIENTE"]
[null,null,null,null,null,null,null,null,null,null,null,null,null,null,null,"2018-09-05",null,null,null,null,null,null,null,null,null,null,98.799999999999699,"SOBRESALIENTE"]
[null,null,null,null,null,null,null,null,null,null,null,null,null,null,null,"2018-09-06",null,null,null,null,null,null,null,null,null,null,98.899999999999693,"SOBRESALIENTE"]
[null,null,null,null,null,null,null,null,null,null,null,null,null,null,null,"2018-09-07",null,null,null,null,null,null,null,null,null,null,98.999999999999702,"SOBRESALIENTE"]
[null,null,null,null,null,null,null,null,null,null,null,null,null,null,null,"2018-09-08",null,null,null,null,null,null,null,null,null,null,99.099999999999696,"SOBRESALIENTE"]
[null,null,null,null,null,null,null,null,null,null,null,null,null,null,null,"2018-09-09",null,null,null,null,null,null,null,null,null,null,99.199999999999704,"SOBRESALIENTE"]
[null,null,null,null,null,null,null,null,null,null,null,null,null,null,null,"2018-09-10",null,null,null,null,null,null,null,null,null,null,99.299999999999699,"SOBRESALIENTE"]
[null,null,null,null,null,null,null,null,null,null,null,null,null,null,null,"2018-09-11",null,null,null,null,null,null,null,null,null,null,99.399999999999693,"SOBRESALIENTE"]
[null,null,null,null,null,null,null,null,null,null,null,null,null,null,null,"2018-09-12",null,null,null,null,null,null,null,null,null,null,99.499999999999702,"SOBRESALIENTE"]
[null,null,null,null,null,null,null,null,null,null,null,null,null,null,null,"2018-09-13",null,null,null,null,null,null,null,null,null,null,99.599999999999696,"SOBRESALIENTE"]
[null,null,null,null,null,null,null,null,null,null,null,null,null,null,null,"2018-09-14",null,null,null,null,null,null,null,null,null,null,99.699999999999704,"SOBRESALIENTE"]
[null,null,null,null,null,null,null,null,null,null,null,null,null,null,null,"2018-09-15",null,null,null,null,null,null,null,null,null,null,99.799999999999699,"SOBRESALIENTE"]
[null,null,null,null,null,null,null,null,null,null,null,null,null,null,null,"2018-09-16",null,null,null,null,null,null,null,null,null,null,99.899999999999693,"SOBRESALIENTE"]
[null,null,null,null,null,null,null,null,null,null,null,null,null,null,null,"2018-09-17",null,null,null,null,null,null,null,null,null,null,99.999999999999702,"SOBRESALIENTE"]
[null,null,null,null,null,null,null,null,null,null,null,null,null,null,null,"2018-09-18"]
[null,null,null,null,null,null,null,null,null,null,null,null,null,null,null,"2018-09-19"]
[null,null,null,null,null,null,null,null,null,null,null,null,null,null,null,"2018-09-20"]
[null,null,null,null,null,null,null,null,null,null,null,null,null,null,null,"2018-09-21"]
[null,null,null,null,null,null,null,null,null,null,null,null,null,null,null,"2018-09-22"]
[null,null,null,null,null,null,null,null,null,null,null,null,null,null,null,"2018-09-23"]
[null,null,null,null,null,null,null,null,null,null,null,null,null,null,null,"2018-09-24"]
[null,null,null,null,null,null,null,null,null,null,null,null,null,null,null,"2018-09-25"]
[null,null,null,null,null,null,null,null,null,null,null,null,null,null,null,"2018-09-26"]
[null,null,null,null,null,null,null,null,null,null,null,null,null,null,null,"2018-09-27"]
[null,null,null,null,null,null,null,null,null,null,null,null,null,null,null,"2018-09-28"]
[null,null,null,null,null,null,null,null,null,null,null,null,null,null,null,"2018-09-29"]
[null,null,null,null,null,null,null,null,null,null,null,null,null,null,null,"2018-09-30"]
[null,null,null,null,null,null,null,null,null,null,null,null,null,null,null,"2018-10-01"]
[null,null,null,null,null,null,null,null,null,null,null,null,null,null,null,"2018-10-02"]
[null,null,null,null,null,null,null,null,null,null,null,null,null,null,null,"2018-10-03"]
[null,null,null,null,null,null,null,null,null,null,null,null,null,null,null,"2018-10-04"]
[null,null,null,null,null,null,null,null,null,null,null,null,null,null,null,"2018-10-05"]
[null,null,null,null,null,null,null,null,null,null,null,null,null,null,null,"2018-10-06"]
[null,null,null,null,null,null,null,null,null,null,null,null,null,null,null,"2018-10-07"]
[null,null,null,null,null,null,null,null,null,null,null,null,null,null,null,"2018-10-08"]
[null,null,null,null,null,null,null,null,null,null,null,null,null,null,null,"2018-10-09"]
[null,null,null,null,null,null,null,null,null,null,null,null,null,null,null,"2018-10-10"]
[null,null,null,null,null,null,null,null,null,null,null,null,null,null,null,"2018-10-11"]
[null,null,null,null,null,null,null,null,null,null,null,null,null,null,null,"2018-10-12"]
[null,null,null,null,null,null,null,null,null,null,null,null,null,null,null,"2018-10-13"]
[null,null,null,null,null,null,null,null,null,null,null,null,null,null,null,"2018-10-14"]
[null,null,null,null,null,null,null,null,null,null,null,null,null,null,null,"2018-10-15"]
[null,null,null,null,null,null,null,null,null,null,null,null,null,null,null,"2018-10-16"]
[null,null,null,null,null,null,null,null,null,null,null,null,null,null,null,"2018-10-17"]
[null,null,null,null,null,null,null,null,null,null,null,null,null,null,null,"2018-10-18"]
[null,null,null,null,null,null,null,null,null,null,null,null,null,null,null,"2018-10-19"]
[null,null,null,null,null,null,null,null,null,null,null,null,null,null,null,"2018-10-20"]
[null,null,null,null,null,null,null,null,null,null,null,null,null,null,null,"2018-10-21"]
[null,null,null,null,null,null,null,null,null,null,null,null,null,null,null,"2018-10-22"]
[null,null,null,null,null,null,null,null,null,null,null,null,null,null,null,"2018-10-23"]
[null,null,null,null,null,null,null,null,null,null,null,null,null,null,null,"2018-10-24"]
[null,null,null,null,null,null,null,null,null,null,null,null,null,null,null,"2018-10-25"]
[null,null,null,null,null,null,null,null,null,null,null,null,null,null,null,"2018-10-26"]
[null,null,null,null,null,null,null,null,null,null,null,null,null,null,null,"2018-10-27"]
[null,null,null,null,null,null,null,null,null,null,null,null,null,null,null,"2018-10-28"]
[null,null,null,null,null,null,null,null,null,null,null,null,null,null,null,"2018-10-29"]
[null,null,null,null,null,null,null,null,null,null,null,null,null,null,null,"2018-10-30"]
[null,null,null,null,null,null,null,null,null,null,null,null,null,null,null,"2018-10-31"]
[null,null,null,null,null,null,null,null,null,null,null,null,null,null,null,"2018-11-01"]
[null,null,null,null,null,null,null,null,null,null,null,null,null,null,null,"2018-11-02"]
[null,null,null,null,null,null,null,null,null,null,null,null,null,null,null,"2018-11-03"]
[null,null,null,null,null,null,null,null,null,null,null,null,null,null,null,"2018-11-04"]
[null,null,null,null,null,null,null,null,null,null,null,null,null,null,null,"2018-11-05"]
[null,null,null,null,null,null,null,null,null,null,null,null,null,null,null,"2018-11-06"]
[null,null,null,null,null,null,null,null,null,null,null,null,null,null,null,"2018-11-07"]
[null,null,null,null,null,null,null,null,null,null,null,null,null,null,null,"2018-11-08"]
[null,null,null,null,null,null,null,null,null,null,null,null,null,null,null,"2018-11-09"]
[null,null,null,null,null,null,null,null,null,null,null,null,null,null,null,"2018-11-10"]
[null,null,null,null,null,null,null,null,null,null,null,null,null,null,null,"2018-11-11"]
[null,null,null,null,null,null,null,null,null,null,null,null,null,null,null,"2018-11-12"]
[null,null,null,null,null,null,null,null,null,null,null,null,null,null,null,"2018-11-13"]
[null,null,null,null,null,null,null,null,null,null,null,null,null,null,null,"2018-11-14"]
[null,null,null,null,null,null,null,null,null,null,null,null,null,null,null,"2018-11-15"]
[null,null,null,null,null,null,null,null,null,null,null,null,null,null,null,"2018-11-16"]
[null,null,null,null,null,null,null,null,null,null,null,null,null,null,null,"2018-11-17"]
[null,null,null,null,null,null,null,null,null,null,null,null,null,null,null,"2018-11-18"]
[null,null,null,null,null,null,null,null,null,null,null,null,null,null,null,"2018-11-19"]
[null,null,null,null,null,null,null,null,null,null,null,null,null,null,null,"2018-11-20"]
[null,null,null,null,null,null,null,null,null,null,null,null,null,null,null,"2018-11-21"]
[null,null,null,null,null,null,null,null,null,null,null,null,null,null,null,"2018-11-22"]
[null,null,null,null,null,null,null,null,null,null,null,null,null,null,null,"2018-11-23"]
[null,null,null,null,null,null,null,null,null,null,null,null,null,null,null,"2018-11-24"]
[null,null,null,null,null,null,null,null,null,null,null,null,null,null,null,"2018-11-25"]
[null,null,null,null,null,null,null,null,null,null,null,null,null,null,null,"2018-11-26"]
[null,null,null,null,null,null,null,null,null,null,null,null,null,null,null,"2018-11-27"]
[null,null,null,null,null,null,null,null,null,null,null,null,null,null,null,"2018-11-28"]
[null,null,null,null,null,null,null,null,null,null,null,null,null,null,null,"2018-11-29"]
[null,null,null,null,null,null,null,null,null,null,null,null,null,null,null,"2018-11-30"]
[null,null,null,null,null,null,null,null,null,null,null,null,null,null,null,"2018-12-01"]
[null,null,null,null,null,null,null,null,null,null,null,null,null,null,null,"2018-12-02"]
[null,null,null,null,null,null,null,null,null,null,null,null,null,null,null,"2018-12-03"]
[null,null,null,null,null,null,null,null,null,null,null,null,null,null,null,"2018-12-04"]
[null,null,null,null,null,null,null,null,null,null,null,null,null,null,null,"2018-12-05"]
[null,null,null,null,null,null,null,null,null,null,null,null,null,null,null,"2018-12-06"]
[null,null,null,null,null,null,null,null,null,null,null,null,null,null,null,"2018-12-07"]
[null,null,null,null,null,null,null,null,null,null,null,null,null,null,null,"2018-12-08"]
[null,null,null,null,null,null,null,null,null,null,null,null,null,null,null,"2018-12-09"]
[null,null,null,null,null,null,null,null,null,null,null,null,null,null,null,"2018-12-10"]
[null,null,null,null,null,null,null,null,null,null,null,null,null,null,null,"2018-12-11"]
[null,null,null,null,null,null,null,null,null,null,null,null,null,null,null,"2018-12-12"]
[null,null,null,null,null,null,null,null,null,null,null,null,null,null,null,"2018-12-13"]
[null,null,null,null,null,null,null,null,null,null,null,null,null,null,null,"2018-12-14"]
[null,null,null,null,null,null,null,null,null,null,null,null,null,null,null,"2018-12-15"]
[null,null,null,null,null,null,null,null,null,null,null,null,null,null,null,"2018-12-16"]
[null,null,null,null,null,null,null,null,null,null,null,null,null,null,null,"2018-12-17"]
[null,null,null,null,null,null,null,null,null,null,null,null,null,null,null,"2018-12-18"]
[null,null,null,null,null,null,null,null,null,null,null,null,null,null,null,"2018-12-19"]
[null,null,null,null,null,null,null,null,null,null,null,null,null,null,null,"2018-12-20"]
[null,null,null,null,null,null,null,null,null,null,null,null,null,null,null,"2018-12-21"]
[null,null,null,null,null,null,null,null,null,null,null,null,null,null,null,"2018-12-22"]
[null,null,null,null,null,null,null,null,null,null,null,null,null,null,null,"2018-12-23"]
[null,null,null,null,null,null,null,null,null,null,null,null,null,null,null,"2018-12-24"]
[null,null,null,null,null,null,null,null,null,null,null,null,null,null,null,"2018-12-25"]
[null,null,null,null,null,null,null,null,null,null,null,null,null,null,null,"2018-12-26"]
[null,null,null,null,null,null,null,null,null,null,null,null,null,null,null,"2018-12-27"]
[null,null,null,null,null,null,null,null,null,null,null,null,null,null,null,"2018-12-28"]
[null,null,null,null,null,null,null,null,null,null,null,null,null,null,null,"2018-12-29"]
[null,null,null,null,null,null,null,null,null,null,null,null,null,null,null,"2018-12-30"]
[null,null,null,null,null,null,null,null,null,null,null,null,null,null,null,"2018-12-31"]
[null,null,null,null,null,null,null,null,null,null,null,null,null,null,null,"2019-01-01"]
[null,null,null,null,null,null,null,null,null,null,null,null,null,null,null,"2019-01-02"]
[null,null,null,null,null,null,null,null,null,null,null,null,null,null,null,"2019-01-03"]
[null,null,null,null,null,null,null,null,null,null,null,null,null,null,null,"2019-01-04"]
[null,null,null,null,null,null,null,null,null,null,null,null,null,null,null,"2019-01-05"]
[null,null,null,null,null,null,null,null,null,null,null,null,null,null,null,"2019-01-06"]
[null,null,null,null,null,null,null,null,null,null,null,null,null,null,null,"2019-01-07"]
[null,null,null,null,null,null,null,null,null,null,null,null,null,null,null,"2019-01-08"]
[null,null,null,null,null,null,null,null,null,null,null,null,null,null,null,"2019-01-09"]
[null,null,null,null,null,null,null,null,null,null,null,null,null,null,null,"2019-01-10"]
[null,null,null,null,null,null,null,null,null,null,null,null,null,null,null,"2019-01-11"]
[null,null,null,null,null,null,null,null,null,null,null,null,null,null,null,"2019-01-12"]
[null,null,null,null,null,null,null,null,null,null,null,null,null,null,null,"2019-01-13"]
[null,null,null,null,null,null,null,null,null,null,null,null,null,null,null,"2019-01-14"]
[null,null,null,null,null,null,null,null,null,null,null,null,null,null,null,"2019-01-15"]
[null,null,null,null,null,null,null,null,null,null,null,null,null,null,null,"2019-01-16"]
[null,null,null,null,null,null,null,null,null,null,null,null,null,null,null,"2019-01-17"]
[null,null,null,null,null,null,null,null,null,null,null,null,null,null,null,"2019-01-18"]
[null,null,null,null,null,null,null,null,null,null,null,null,null,null,null,"2019-01-19"]
[null,null,null,null,null,null,null,null,null,null,null,null,null,null,null,"2019-01-20"]
[null,null,null,null,null,null,null,null,null,null,null,null,null,null,null,"2019-01-21"]
[null,null,null,null,null,null,null,null,null,null,null,null,null,null,null,"2019-01-22"]
[null,null,null,null,null,null,null,null,null,null,null,null,null,null,null,"2019-01-23"]
[null,null,null,null,null,null,null,null,null,null,null,null,null,null,null,"2019-01-24"]
[null,null,null,null,null,null,null,null,null,null,null,null,null,null,null,"2019-01-25"]
[null,null,null,null,null,null,null,null,null,null,null,null,null,null,null,"2019-01-26"]
[null,null,null,null,null,null,null,null,null,null,null,null,null,null,null,"2019-01-27"]
[null,null,null,null,null,null,null,null,null,null,null,null,null,null,null,"2019-01-28"]
[null,null,null,null,null,null,null,null,null,null,null,null,null,null,null,"2019-01-29"]
[null,null,null,null,null,null,null,null,null,null,null,null,null,null,null,"2019-01-30"]
[null,null,null,null,null,null,null,null,null,null,null,null,null,null,null,"2019-01-31"]
[null,null,null,null,null,null,null,null,null,null,null,null,null,null,null,"2019-02-01"]
[null,null,null,null,null,null,null,null,null,null,null,null,null,null,null,"2019-02-02"]
[null,null,null,null,null,null,null,null,null,null,null,null,null,null,null,"2019-02-03"]
[null,null,null,null,null,null,null,null,null,null,null,null,null,null,null,"2019-02-04"]
[null,null,null,null,null,null,null,null,null,null,null,null,null,null,null,"2019-02-05"]
[null,null,null,null,null,null,null,null,null,null,null,null,null,null,null,"2019-02-06"]
[null,null,null,null,null,null,null,null,null,null,null,null,null,null,null,"2019-02-07"]
[null,null,null,null,null,null,null,null,null,null,null,null,null,null,null,"2019-02-08"]
[null,null,null,null,null,null,null,null,null,null,null,null,null,null,null,"2019-02-09"]
[null,null,null,null,null,null,null,null,null,null,null,null,null,null,null,"2019-02-10"]
[null,null,null,null,null,null,null,null,null,null,null,null,null,null,null,"2019-02-11"]
[null,null,null,null,null,null,null,null,null,null,null,null,null,null,null,"2019-02-12"]
[null,null,null,null,null,null,null,null,null,null,null,null,null,null,null,"2019-02-13"]
[null,null,null,null,null,null,null,null,null,null,null,null,null,null,null,"2019-02-14"]
[null,null,null,null,null,null,null,null,null,null,null,null,null,null,null,"2019-02-15"]
[null,null,null,null,null,null,null,null,null,null,null,null,null,null,null,"2019-02-16"]
[null,null,null,null,null,null,null,null,null,null,null,null,null,null,null,"2019-02-17"]
[null,null,null,null,null,null,null,null,null,null,null,null,null,null,null,"2019-02-18"]
[null,null,null,null,null,null,null,null,null,null,null,null,null,null,null,"2019-02-19"]
[null,null,null,null,null,null,null,null,null,null,null,null,null,null,null,"2019-02-20"]
[null,null,null,null,null,null,null,null,null,null,null,null,null,null,null,"2019-02-21"]
[null,null,null,null,null,null,null,null,null,null,null,null,null,null,null,"2019-02-22"]
[null,null,null,null,null,null,null,null,null,null,null,null,null,null,null,"2019-02-23"]
[null,null,null,null,null,null,null,null,null,null,null,null,null,null,null,"2019-02-24"]
[null,null,null,null,null,null,null,null,null,null,null,null,null,null,null,"2019-02-25"]
[null,null,null,null,null,null,null,null,null,null,null,null,null,null,null,"2019-02-26"]
[null,null,null,null,null,null,null,null,null,null,null,null,null,null,null,"2019-02-27"]
[null,null,null,null,null,null,null,null,null,null,null,null,null,null,null,"2019-02-28"]
[null,null,null,null,null,null,null,null,null,null,null,null,null,null,null,"2019-03-01"]
[null,null,null,null,null,null,null,null,null,null,null,null,null,null,null,"2019-03-02"]
[null,null,null,null,null,null,null,null,null,null,null,null,null,null,null,"2019-03-03"]
[null,null,null,null,null,null,null,null,null,null,null,null,null,null,null,"2019-03-04"]
[null,null,null,null,null,null,null,null,null,null,null,null,null,null,null,"2019-03-05"]
[null,null,null,null,null,null,null,null,null,null,null,null,null,null,null,"2019-03-06"]
[null,null,null,null,null,null,null,null,null,null,null,null,null,null,null,"2019-03-07"]
[null,null,null,null,null,null,null,null,null,null,null,null,null,null,null,"2019-03-08"]
[null,null,null,null,null,null,null,null,null,null,null,null,null,null,null,"2019-03-09"]
[null,null,null,null,null,null,null,null,null,null,null,null,null,null,null,"2019-03-10"]
[null,null,null,null,null,null,null,null,null,null,null,null,null,null,null,"2019-03-11"]
[null,null,null,null,null,null,null,null,null,null,null,null,null,null,null,"2019-03-12"]
[null,null,null,null,null,null,null,null,null,null,null,null,null,null,null,"2019-03-13"]
[null,null,null,null,null,null,null,null,null,null,null,null,null,null,null,"2019-03-14"]
[null,null,null,null,null,null,null,null,null,null,null,null,null,null,null,"2019-03-15"]
[null,null,null,null,null,null,null,null,null,null,null,null,null,null,null,"2019-03-16"]
[null,null,null,null,null,null,null,null,null,null,null,null,null,null,null,"2019-03-17"]
[null,null,null,null,null,null,null,null,null,null,null,null,null,null,null,"2019-03-18"]
[null,null,null,null,null,null,null,null,null,null,null,null,null,null,null,"2019-03-19"]
[null,null,null,null,null,null,null,null,null,null,null,null,null,null,null,"2019-03-20"]
[null,null,null,null,null,null,null,null,null,null,null,null,null,null,null,"2019-03-21"]
[null,null,null,null,null,null,null,null,null,null,null,null,null,null,null,"2019-03-22"]
[null,null,null,null,null,null,null,null,null,null,null,null,null,null,null,"2019-03-23"]
[null,null,null,null,null,null,null,null,null,null,null,null,null,null,null,"2019-03-24"]
[null,null,null,null,null,null,null,null,null,null,null,null,null,null,null,"2019-03-25"]
[null,null,null,null,null,null,null,null,null,null,null,null,null,null,null,"2019-03-26"]
[null,null,null,null,null,null,null,null,null,null,null,null,null,null,null,"2019-03-27"]
[null,null,null,null,null,null,null,null,null,null,null,null,null,null,null,"2019-03-28"]
[null,null,null,null,null,null,null,null,null,null,null,null,null,null,null,"2019-03-29"]
[null,null,null,null,null,null,null,null,null,null,null,null,null,null,null,"2019-03-30"]
[null,null,null,null,null,null,null,null,null,null,null,null,null,null,null,"2019-03-31"]
[null,null,null,null,null,null,null,null,null,null,null,null,null,null,null,"2019-04-01"]
[null,null,null,null,null,null,null,null,null,null,null,null,null,null,null,"2019-04-02"]

{"sheet":"F3. EVIDENCIAS","index":4,"n_rows":83,"n_cols":18,"rows_kept":83,"cut":false,"hidden":false,"merged":[[70,17,74,18],[75,17,79,18],[30,2,34,6],[35,2,39,6],[40,2,44,6],[45,2,49,6],[50,2,54,6],[55,2,59,6],[40,13,44,14],[45,13,49,14],[50,13,54,14],[55,13,59,14],[40,17,44,18],[45,17,49,18],[50,17,54,18],[30,17,34,18],[55,17,59,18],[60,17,64,18],[65,17,69,18],[65,2,69,6],[65,7,69,12],[65,13,69,14],[35,16,39,16],[30,16,34,16],[70,0,74,1],[70,2,74,6],[70,7,74,12],[70,13,74,14],[70,16,74,16],[40,0,44,1],[45,0,49,1],[50,0,54,1],[55,0,59,1],[60,0,64,1],[60,13,64,14],[40,7,44,12],[45,7,49,12],[50,7,54,12],[55,7,59,12],[60,7,64,12],[40,16,44,16],[45,16,49,16],[50,16,54,16],[55,16,59,16],[60,16,64,16],[65,16,69,16],[60,2,64,6],[65,0,69,1],[25,6,25,12],[25,13,25,14],[25,15,25,16],[30,0,34,1],[35,0,39,1],[27,13,29,14],[30,13,34,14],[35,13,39,14],[27,7,29,12],[30,7,34,12],[35,7,39,12],[27,2,29,6],[27,0,29,1],[9,0,9,18],[10,0,10,1],[10,2,10,4],[10,5,10,7],[10,8,10,10],[10,11,10,14],[10,15,10,18],[11,0,11,1],[11,2,11,4],[11,5,11,7],[11,8,11,10],[11,11,11,14],[11,15,11,18],[12,0,12,7],[12,8,12,18],[13,0,13,7],[13,8,13,18],[19,13,19,14],[19,15,19,16],[19,17,19,18],[20,0,20,5],[18,0,18,1],[18,2,18,4],[15,0,15,4],[15,5,15,6],[16,0,16,18],[14,5,14,6],[17,0,17,1],[17,2,17,4],[17,5,17,7],[17,8,17,10],[17,11,17,14],[17,15,17,18],[20,6,20,12],[20,13,20,14],[20,15,20,16],[14,0,14,4],[0,0,0,18],[1,0,8,3],[3,4,4,15],[1,4,2,15],[1,16,8,18],[5,4,8,8],[8,9,8,13],[8,14,8,15],[5,9,5,15],[6,9,6,13],[7,9,7,13],[6,14,6,15],[7,14,7,15],[27,17,29,18],[20,17,20,18],[21,0,21,18],[22,0,22,1],[22,2,22,4],[22,5,22,7],[22,8,22,10],[22,11,22,14],[22,15,22,18],[25,17,25,18],[23,0,23,1],[23,2,23,4],[23,5,23,7],[23,8,23,10],[23,11,23,14],[23,15,23,18],[24,0,24,5],[24,6,24,12],[24,13,24,14],[24,15,24,16],[24,17,24,18],[27,15,29,15],[27,16,29,16],[25,0,25,5],[14,8,15,9],[14,10,15,18],[75,0,79,1],[75,2,79,6],[75,7,79,12],[75,13,79,14],[80,0,80,18],[81,0,84,1],[81,2,84,4],[81,16,84,18],[81,5,84,9],[82,15,84,15],[81,10,81,11],[82,10,84,11],[81,12,84,14],[75,16,79,16],[18,5,18,7],[18,8,18,10],[18,11,18,14],[18,15,18,18],[19,0,19,5],[19,6,19,12],[26,0,26,18],[35,17,39,18]]}
[]
[null,null,null,null,"COMISIÓN NACIONAL DEL SERVICIO CIVIL \n    "]
[]
[null,null,null,null," FORMATO 3 DE EVIDENCIAS"]
[]
[null,null,null,null,"PROCESO: EVALUACIÓN DEL DESEMPEÑO LABORAL",null,null,null,null,"CÓDIGO:  F-ED-004"]
[null,null,null,null,null,null,null,null,null,"FECHA EMISIÓN",null,null,null,null,"2016-02-10"]
[null,null,null,null,null,null,null,null,null,"Página",null,null,null,null,"1 de 1"]
[null,null,null,null,null,null,null,null,null,"Versión ",null,null,null,null,"1.0"]
["I. IDENTIFICACIÓN DEL EVALUADO"]
["Tipo de Documento",null,"Número de identificación",null,null,"Primer apellido",null,null,"Segundo apellido",null,null,"Primer nombre",null,null,null,"Otros nombres"]
[{"$f":"'F2. COMP. LAB Y COM COMPOR'!A13:B13","v":"CÉDULA DE CIUDADANÍA"},null,{"$f":"'F2. COMP. LAB Y COM COMPOR'!C13:E13","v":0},null,null,{"$f":"'F2. COMP. LAB Y COM COMPOR'!F13:H13","v":""},null,null,{"$f":"'F2. COMP. LAB Y COM COMPOR'!I13:K13","v":""},null,null,{"$f":"'F2. COMP. LAB Y COM COMPOR'!L13:O13","v":""},null,null,null,{"$f":"'F2. COMP. LAB Y COM COMPOR'!P13:S13","v":""}]
["Dependencia o área a la que pertenece el evaluado",null,null,null,null,null,null,null,"Denominación del empleo"]
[{"$f":"'F2. COMP. LAB Y COM COMPOR'!A15:H15","v":""},null,null,null,null,null,null,null,{"$f":"'F2. COMP. LAB Y COM COMPOR'!I15:S15","v":""}]
["Nivel jerárquico",null,null,null,null,"Código",null,"Grado",{"$f":"'F2. COMP. LAB Y COM COMPOR'!I16","v":"Propósito del empleo:"},null,{"$f":"'F2. COMP. LAB Y COM COMPOR'!J16","v":0}]
[{"$f":"'F2. COMP. LAB Y COM COMPOR'!A17:E17","v":""},null,null,null,null,{"$f":"'F2. COMP. LAB Y COM COMPOR'!F17:G17","v":""},null,{"$f":"'F2. COMP. LAB Y COM COMPOR'!H17","v":""}]
["II. IDENTIFICACIÓN EVALUADOR. (Jefe inmediato)"]
["Tipo de documento",null,"Número de identificación",null,null,"Primer apellido",null,null,"Segundo apellido",null,null,"Primer nombre",null,null,null,"Otros nombres"]
[{"$f":"'F2. COMP. LAB Y COM COMPOR'!A20:B20","v":"CEDULA DE CIUDADANIA"},null,{"$f":"'F2. COMP. LAB Y COM COMPOR'!C20:E20","v":0},null,null,{"$f":"'F2. COMP. LAB Y COM COMPOR'!F20:H20","v":""},null,null,{"$f":"'F2. COMP. LAB Y COM COMPOR'!I20:K20","v":""},null,null,{"$f":"'F2. COMP. LAB Y COM COMPOR'!L20:O20","v":""},null,null,null,{"$f":"'F2. COMP. LAB Y COM COMPOR'!P20:S20","v":""}]
[" Área o Dependencia a la que pertenece el evaluador",null,null,null,null,null,"Denominación del empleo",null,null,null,null,null,null,"Código",null,"Grado",null,"Nivel jerárquico"]
[{"$f":"'F2. COMP. LAB Y COM COMPOR'!A22:F22","v":""},null,null,null,null,null,{"$f":"'F2. COMP. LAB Y COM COMPOR'!G22:M22","v":""},null,null,null,null,null,null,{"$f":"'F2. COMP. LAB Y COM COMPOR'!N22:O22","v":""},null,{"$f":"'F2. COMP. LAB Y COM COMPOR'!P22:Q22","v":""},null,{"$f":"'F2. COMP. LAB Y COM COMPOR'!R22:S22","v":""}]
["III. IDENTIFICACIÓN EVALUADOR (Servidor público de Libre Nombramiento y Remoción en caso de constituir Comisión Evaluadora)"]
["Tipo de documento",null,"Número de identificación",null,null,"Primer apellido",null,null,"Segundo apellido",null,null,"Primer nombre",null,null,null,"Otros nombres"]
[{"$f":"'F2. COMP. LAB Y COM COMPOR'!A25:B25","v":"CEDULA DE CIUDADANIA"},null,{"$f":"'F2. COMP. LAB Y COM COMPOR'!C25:E25","v":0},null,null,{"$f":"'F2. COMP. LAB Y COM COMPOR'!F25:H25","v":""},null,null,{"$f":"'F2. COMP. LAB Y COM COMPOR'!I25:K25","v":""},null,null,{"$f":"'F2. COMP. LAB Y COM COMPOR'!L25:O25","v":""},null,null,null,{"$f":"'F2. COMP. LAB Y COM COMPOR'!P25:S25","v":""}]
["Dependencia o área a la que pertenece el evaluador",null,null,null,null,null,"Denominación del empleo",null,null,null,null,null,null,"Código",null,"Grado",null,"Nivel jerárquico"]
[{"$f":"'F2. COMP. LAB Y COM COMPOR'!A27:F27","v":""},null,null,null,null,null,{"$f":"'F2. COMP. LAB Y COM COMPOR'!G27:M27","v":""},null,null,null,null,null,null,{"$f":"'F2. COMP. LAB Y COM COMPOR'!N27:O27","v":""},null,{"$f":"'F2. COMP. LAB Y COM COMPOR'!P27:Q27","v":""},null,{"$f":"'F2. COMP. LAB Y COM COMPOR'!R27:S27","v":""}]
["IV. EVIDENCIAS"]
["Componente de evaluación",null,"Compromisos y Competencias",null,null,null,null,"Descripción de la evidencia",null,null,null,null,null,"Ubicación de la evidencia.",null,"Fecha de Inclusión de la evidencia","Observaciones","Evidencia Aportada por"]
[]
[]
[null,null,{"$f":"VLOOKUP(A31,Hoja4!A$459:B$474,2,FALSE)","v":{"$error":"#N/A"}}]
[]
[]
[]
[]
[null,null,{"$f":"VLOOKUP(A36,Hoja4!A$459:B$474,2,FALSE)","v":{"$error":"#N/A"}}]
[]
[]
[]
[]
[null,null,{"$f":"VLOOKUP(A41,Hoja4!A$459:B$474,2,FALSE)","v":{"$error":"#N/A"}}]
[]
[]
[]
[]
[null,null,{"$f":"VLOOKUP(A46,Hoja4!A$459:B$474,2,FALSE)","v":{"$error":"#N/A"}}]
[]
[]
[]
[]
[null,null,{"$f":"VLOOKUP(A51,Hoja4!A$459:B$474,2,FALSE)","v":{"$error":"#N/A"}}]
[]
[]
[]
[]
[null,null,{"$f":"VLOOKUP(A56,Hoja4!A$459:B$474,2,FALSE)","v":{"$error":"#N/A"}}]
[]
[]
[]
[]
[null,null,{"$f":"VLOOKUP(A61,Hoja4!A$459:B$474,2,FALSE)","v":{"$error":"#N/A"}}]
[]
[]
[]
[]
[null,null,{"$f":"VLOOKUP(A66,Hoja4!A$459:B$474,2,FALSE)","v":{"$error":"#N/A"}}]
[]
[]
[]
[]
[null,null,{"$f":"VLOOKUP(A71,Hoja4!A$459:B$474,2,FALSE)","v":{"$error":"#N/A"}}]
[]
[]
[]
[]
[null,null,{"$f":"VLOOKUP(A76,Hoja4!A$459:B$474,2,FALSE)","v":{"$error":"#N/A"}}]
[]
[]
[]
[]
["V. FORMALIZACIÒN DE LA EVIDENCIAS. (FIRMAS)"]
["EVALUADO",null,"NOMBRE, FIRMA Y NÚMERO DE CÉDULA.",null,null,null,null,null,null,null,"EVALUADOR",null,null,null,null,"TERCERO"]
[null,null,null,null,null,null,null,null,null,null,"NOMBRE, FIRMA Y NÚMERO DE CÉDULA.",null,null,null,null,"NOMBRE, FIRMA Y NÚMERO DE CÉDULA"]

{"sheet":"F4. CALF. COM. COMPORT.","index":5,"n_rows":50,"n_cols":21,"rows_kept":50,"cut":false,"hidden":false,"merged":[[36,13,36,14],[34,13,34,14],[32,13,32,14],[31,13,31,14],[33,13,33,14],[35,13,35,14],[37,13,37,14],[38,13,39,14],[40,13,41,14],[21,0,21,1],[16,5,16,7],[16,8,16,10],[16,11,16,14],[16,15,16,18],[24,0,24,5],[24,6,24,12],[24,13,24,14],[24,15,24,16],[24,17,24,18],[17,15,17,18],[19,0,19,5],[19,6,19,12],[19,13,19,14],[19,15,19,16],[19,17,19,18],[23,0,23,5],[23,6,23,12],[20,0,20,18],[22,0,22,1],[22,2,22,4],[22,5,22,7],[23,13,23,14],[23,15,23,16],[23,17,23,18],[22,8,22,10],[22,11,22,14],[22,15,22,18],[21,2,21,4],[21,5,21,7],[21,8,21,10],[21,11,21,14],[21,15,21,18],[9,15,9,18],[12,8,12,18],[14,0,14,4],[14,5,14,6],[13,8,14,8],[13,13,14,18],[18,13,18,14],[18,15,18,16],[18,17,18,18],[18,0,18,5],[18,6,18,12],[11,0,11,7],[11,8,11,18],[13,0,13,4],[13,5,13,6],[12,0,12,7],[15,0,15,18],[17,0,17,1],[17,2,17,4],[17,5,17,7],[17,8,17,10],[17,11,17,14],[16,0,16,1],[16,2,16,4],[48,0,48,2],[48,3,48,8],[48,13,48,14],[48,16,48,18],[49,0,49,2],[49,3,49,8],[49,13,49,14],[49,16,49,18],[46,0,46,2],[46,3,46,8],[46,13,46,14],[46,16,46,18],[47,0,47,2],[47,3,47,8],[47,13,47,14],[47,16,47,18],[38,0,41,8],[43,0,43,18],[44,0,45,2],[44,3,45,8],[44,13,44,18],[45,13,45,14],[45,16,45,18],[42,0,42,8],[42,13,42,14],[30,16,42,17],[30,18,42,18],[34,0,35,1],[34,2,35,3],[34,4,35,8],[36,0,37,1],[36,2,37,3],[36,4,37,8],[30,0,31,1],[30,2,31,3],[30,4,31,8],[32,0,33,1],[32,2,33,3],[32,4,33,8],[30,13,30,14],[25,0,25,18],[26,0,29,1],[26,2,29,3],[26,4,29,8],[27,9,29,9],[27,10,29,10],[27,11,29,11],[27,12,29,12],[27,16,29,17],[27,18,29,18],[26,16,26,18],[26,13,29,14],[8,0,8,18],[10,0,10,1],[10,2,10,4],[10,5,10,7],[10,8,10,10],[10,11,10,14],[10,15,10,18],[0,0,7,3],[0,4,1,14],[0,15,7,18],[2,4,3,14],[4,4,7,6],[4,7,4,14],[5,7,5,11],[6,7,6,11],[7,7,7,11],[5,12,5,14],[6,12,6,14],[7,12,7,14],[9,0,9,1],[9,2,9,4],[9,5,9,7],[9,8,9,10],[9,11,9,14]]}
[null,null,null,null,"COMISIÓN NACIONAL DEL SERVICIO CIVIL"]
[]
[null,null,null,null,"FORMATO 4. CALIFICACIÓN DE COMPETENCIAS COMPORTAMENTALES"]
[]
[null,null,null,null,"PROCESO: EVALUACIÓN DEL DESEMPEÑO LABORAL",null,null,"CÓDIGO:  F-ED-005"]
[null,null,null,null,null,null,null,"FECHA EMISIÓN",null,null,null,null,"2016-02-10"]
[null,null,null,null,null,null,null,"Página",null,null,null,null,"1 de 1"]
[null,null,null,null,null,null,null,"Versión ",null,null,null,null,"1.0"]
["I. IDENTIFICACIÓN DEL EVALUADO"]
["Tipo de Documento",null,"Número de identificación",null,null,"Primer apellido",null,null,"Segundo apellido",null,null,"Primer nombre",null,null,null,"Otros nombres"]
[{"$f":"'F2. COMP. LAB Y COM COMPOR'!A13:B13","v":"CÉDULA DE CIUDADANÍA"},null,{"$f":"'F2. COMP. LAB Y COM COMPOR'!C13:E13","v":0},null,null,{"$f":"'F2. COMP. LAB Y COM COMPOR'!F13:H13","v":""},null,null,{"$f":"'F2. COMP. LAB Y COM COMPOR'!I13:K13","v":""},null,null,{"$f":"'F2. COMP. LAB Y COM COMPOR'!L13:O13","v":""},null,null,null,{"$f":"'F2. COMP. LAB Y COM COMPOR'!P13:S13","v":""}]
["Dependencia o área a la que pertenece el evaluado",null,null,null,null,null,null,null,"Denominación del empleo"]
[{"$f":"'F2. COMP. LAB Y COM COMPOR'!A15:H15","v":""},null,null,null,null,null,null,null,{"$f":"'F2. COMP. LAB Y COM COMPOR'!I15:S15","v":""}]
["Nivel jerárquico",null,null,null,null,"Código",null,"Grado",{"$f":"'F2. COMP. LAB Y COM COMPOR'!I16","v":"Propósito del empleo:"},null,null,null,null,{"$f":"'F2. COMP. LAB Y COM COMPOR'!J16","v":0}]
[{"$f":"'F2. COMP. LAB Y COM COMPOR'!A17:E17","v":""},null,null,null,null,{"$f":"'F2. COMP. LAB Y COM COMPOR'!F17:G17","v":""},null,{"$f":"'F2. COMP. LAB Y COM COMPOR'!H17","v":""}]
["II. IDENTIFICACIÓN EVALUADOR. (Jefe inmediato)"]
["Tipo de documento",null,"Número de identificación",null,null,"Primer apellido",null,null,"Segundo apellido",null,null,"Primer nombre",null,null,null,"Otros nombres"]
[{"$f":"'F2. COMP. LAB Y COM COMPOR'!A20:B20","v":"CEDULA DE CIUDADANIA"},null,{"$f":"'F2. COMP. LAB Y COM COMPOR'!C20:E20","v":0},null,null,{"$f":"'F2. COMP. LAB Y COM COMPOR'!F20:H20","v":""},null,null,{"$f":"'F2. COMP. LAB Y COM COMPOR'!I20:K20","v":""},null,null,{"$f":"'F2. COMP. LAB Y COM COMPOR'!L20:O20","v":""},null,null,null,{"$f":"'F2. COMP. LAB Y COM COMPOR'!P20:S20","v":""}]
[" Área o Dependencia a la que pertenece el evaluador",null,null,null,null,null,"Denominación del empleo",null,null,null,null,null,null,"Código",null,"Grado",null,"Nivel jerárquico"]
[{"$f":"'F2. COMP. LAB Y COM COMPOR'!A22:F22","v":""},null,null,null,null,null,{"$f":"'F2. COMP. LAB Y COM COMPOR'!G22:M22","v":""},null,null,null,null,null,null,{"$f":"'F2. COMP. LAB Y COM COMPOR'!N22:O22","v":""},null,{"$f":"'F2. COMP. LAB Y COM COMPOR'!P22:Q22","v":""},null,{"$f":"'F2. COMP. LAB Y COM COMPOR'!R22:S22","v":""}]
["III. IDENTIFICACIÓN EVALUADOR (Servidor público de Libre Nombramiento y Remoción en caso de constituir Comisión Evaluadora)"]
["Tipo de documento",null,"Número de identificación",null,null,"Primer apellido",null,null,"Segundo apellido",null,null,"Primer nombre",null,null,null,"Otros nombres"]
[{"$f":"'F2. COMP. LAB Y COM COMPOR'!A25:B25","v":"CEDULA DE CIUDADANIA"},null,{"$f":"'F2. COMP. LAB Y COM COMPOR'!C25:E25","v":0},null,null,{"$f":"'F2. COMP. LAB Y COM COMPOR'!F25:H25","v":""},null,null,{"$f":"'F2. COMP. LAB Y COM COMPOR'!I25:K25","v":""},null,null,{"$f":"'F2. COMP. LAB Y COM COMPOR'!L25:O25","v":""},null,null,null,{"$f":"'F2. COMP. LAB Y COM COMPOR'!P25:S25","v":""}]
["Dependencia o área a la que pertenece el evaluador",null,null,null,null,null,"Denominación del empleo",null,null,null,null,null,null,"Código",null,"Grado",null,"Nivel jerárquico"]
[{"$f":"'F2. COMP. LAB Y COM COMPOR'!A27:F27","v":""},null,null,null,null,null,{"$f":"'F2. COMP. LAB Y COM COMPOR'!G27:M27","v":""},null,null,null,null,null,null,{"$f":"'F2. COMP. LAB Y COM COMPOR'!N27:O27","v":""},null,{"$f":"'F2. COMP. LAB Y COM COMPOR'!P27:Q27","v":""},null,{"$f":"'F2. COMP. LAB Y COM COMPOR'!R27:S27","v":""}]
["IV. CALIFICACIÓN COMPETENCIAS COMPORTAMENTALES DEL EMPLEADO PÚBLICO."]
["COMPETENCIA",null,"DEFINICIÓN ",null,"CONDUCTAS ASOCIADAS",null,null,null,null,null,null,null,null,"PERÍODO SEMESTRAL",null,null," REFERENCIA PARA UNA "]
[null,null,null,null,null,null,null,null,null,null,null,null,null,null,null,null," EVALUACIÓN POR PERIODO INFERIOR A UN AÑO",null," EVALUACIÓN EXTRAORDINARIA"]
[]
[]
[{"$f":"'F2. COMP. LAB Y COM COMPOR'!B50","v":0},null,{"$f":"+'F2. COMP. LAB Y COM COMPOR'!B50","v":0},null,{"$f":"VLOOKUP(A31,Hoja4!A220:C242,3,FALSE)","v":{"$error":"#N/A"}},null,null,null,null,null,null,null,null,null,null,null,"CALIFICAR EN FORMATO F10. EVALUACIÓN INFERIOR AL SEMESTRE\n\nTITULO V. COMPETENCIAS COMPORTAMENTALES.",null,"CALIFICAR EN FORMATO F9. EVALUACIÓN EXTRAORDINARIA\n\nTITULO V. COMPETENCIAS COMPORTAMENTALES.",null,"BASICO"]
[null,null,null,null,null,null,null,null,null,null,null,null,null,{"$f":"IFERROR(VLOOKUP(N31,Hoja4!$A$246:$B$250,2,FALSE),\"\")","v":""},null,null,null,null,null,null,"INTERMEDIO"]
[{"$f":"'F2. COMP. LAB Y COM COMPOR'!B52","v":0},null,{"$f":"+'F2. COMP. LAB Y COM COMPOR'!B52","v":0},null,{"$f":"VLOOKUP(A33,Hoja4!A222:C244,3,FALSE)","v":{"$error":"#N/A"}},null,null,null,null,null,null,null,null,null,null,null,null,null,null,null,"AVANZADO"]
[null,null,null,null,null,null,null,null,null,null,null,null,null,{"$f":"IFERROR(VLOOKUP(N33,Hoja4!$A$246:$B$250,2,FALSE),\"\")","v":""},null,null,null,null,null,null,"SUPERIOR "]
[{"$f":"'F2. COMP. LAB Y COM COMPOR'!B54","v":0},null,{"$f":"+'F2. COMP. LAB Y COM COMPOR'!B54","v":0},null,{"$f":"VLOOKUP(A35,Hoja4!A220:C242,3,FALSE)","v":{"$error":"#N/A"}}]
[null,null,null,null,null,null,null,null,null,null,null,null,null,{"$f":"IFERROR(VLOOKUP(N35,Hoja4!$A$246:$B$250,2,FALSE),\"\")","v":""}]
[{"$f":"'F2. COMP. LAB Y COM COMPOR'!B56","v":0},null,{"$f":"+'F2. COMP. LAB Y COM COMPOR'!B56","v":0},null,{"$f":"VLOOKUP(A37,Hoja4!A221:C242,3,FALSE)","v":{"$error":"#N/A"}}]
[null,null,null,null,null,null,null,null,null,null,null,null,null,{"$f":"IFERROR(VLOOKUP(N37,Hoja4!$A$246:$B$250,2,FALSE),\"\")","v":""},null,null,null,null,null,null,4]
["CALIFICACIÓN EVALUACIÓN  DE LAS COMPETENCIAS COMPORTAMENTALES.",null,null,null,null,null,null,null,null,null,null,null,null,"CALIFICACIÓN EVALUACIÓN SEMESTRAL"]
[]
[null,null,null,null,null,null,null,null,null,null,null,null,null,{"$f":"SUM(N32,N34,N36,N38,)/4","v":0}]
[]
["CALIFICACIÓN  DEFINITIVA DE LAS COMPETENCIAS COMPORTAMENTALES PARA EL PERÍODO SEMESTRAL",null,null,null,null,null,null,null,null,null,null,null,null,{"$f":"N41","v":0}]
["V. (*) ESCALA CUALITATIVA Y CUANTITATIVA DE LOS NIVELES DE DESARROLLO DE LAS COMPETENCIAS COMPORTAMENTALES."]
["NIVELES DE DESARROLLO",null,null,"DESCRIPCIÓN CUALITATIVA",null,null,null,null,null,null,null,null,null,"RESULTADOS CUANTITATIVOS"]
[null,null,null,null,null,null,null,null,null,null,null,null,null,"PERÍODO SEMESTRAL U ORDINARIO, (PARCIALES EVENTUALES)",null,null,"EVALUACIÓN EXTRAORDINARIA-EVALUACIÓN EN PERIODO DE PRUEBA"]
["BAJO",null,null,"El nivel de desarrollo de la competencia no se presenta con un impacto positivo que permita la obtención de las metas y logros esperados.",null,null,null,null,null,null,null,null,null,4,null,null,6]
["ACEPTABLE",null,null,"El nivel de desarrollo de la competencia se presenta de manera intermitente, con un mediano impacto en la obtención de metas y logros esperados.",null,null,null,null,null,null,null,null,null,6,null,null,9]
["ALTO",null,null,"El nivel de desarrollo de la competencia se presenta de manera permanente e impacta significativamente de manera positiva la obtención de metas y logros esperados.",null,null,null,null,null,null,null,null,null,8,null,null,12]
["MUY ALTO",null,null,"El nivel de desarrollo de la competencia se presenta de manera permanente, impactando significativamente la obtención de metas y logros esperados y agrega valor a los procesos generando un alto nivel de confianza.",null,null,null,null,null,null,null,null,null,10,null,null,15]

{"sheet":"F5. EVA. ÁREAS O DEPENDENCIAS.","index":6,"n_rows":40,"n_cols":13,"rows_kept":40,"cut":false,"hidden":false,"merged":[[17,9,17,12],[15,9,15,12],[33,1,34,12],[35,2,35,11],[31,7,31,8],[32,7,32,8],[29,7,29,8],[27,7,27,8],[28,7,28,8],[27,2,27,6],[28,2,28,6],[29,2,29,6],[24,7,24,8],[23,2,23,6],[24,2,24,6],[25,7,25,8],[21,7,21,8],[22,7,22,8],[21,2,21,6],[22,2,22,6],[23,7,23,8],[19,7,19,8],[20,7,20,8],[19,2,19,6],[20,2,20,6],[17,7,17,8],[18,7,18,8],[17,2,17,6],[18,2,18,6],[12,1,14,1],[12,2,14,6],[12,7,14,8],[12,9,14,12],[16,9,16,12],[20,9,20,12],[21,9,21,12],[22,9,22,12],[0,1,7,4],[4,5,7,7],[7,8,7,9],[2,5,3,10],[0,5,1,10],[15,7,15,8],[16,7,16,8],[15,2,15,6],[16,2,16,6],[8,1,8,12],[9,1,10,4],[9,8,10,9],[11,1,11,12],[4,8,4,10],[5,8,5,9],[6,8,6,9],[0,11,7,12],[31,9,31,12],[30,7,30,8],[23,9,23,12],[24,9,24,12],[25,9,25,12],[26,9,26,12],[27,9,27,12],[26,7,26,8],[28,9,28,12],[29,9,29,12],[30,9,30,12],[18,9,18,12],[39,1,39,12],[16,15,16,22],[17,15,17,16],[17,19,17,20],[6,13,6,15],[7,13,7,15],[32,9,32,12],[38,2,38,12],[31,2,31,6],[32,2,32,6],[36,2,36,11],[37,2,37,12],[30,2,30,6],[25,2,25,6],[26,2,26,6],[19,9,19,12]]}
[null,null,null,null,null,"\nCOMISIÓN NACIONAL DEL SERVICIO CIVIL\n    "]
[]
[null,null,null,null,null,"FORMATO 5. EVALUACIÓN DE GESTIÓN POR ÁREAS O  DEPENDENCIAS"]
[]
[null,null,null,null,null,"PROCESO: EVALUACIÓN DEL DESEMPEÑO LABORAL",null,null,"CÓDIGO:  F-ED-006"]
[null,null,null,null,null,null,null,null,"FECHA EMISIÓN",null,"2016-02-10"]
[null,null,null,null,null,null,null,null,"Página",null,"1 de 1"]
[null,null,null,null,null,null,null,null,"Versión ",null,"1.0"]
[]
[null,"PERÍODO DE VIGENCIA ",null,null,null,"DÍA","MES","AÑO","al",null,"DÍA","MES","AÑO"]
[]
[null,"Resultados de la evaluación por áreas o dependencias"]
[null,"N°","ÁREA O DEPENDENCIA.",null,null,null,null,"CALIFICACIÓN DEL ÁREA O DEPENDENCIA",null,"OBSERVACIONES"]
[]
[]
[null,1]
[null,2]
[null,3]
[null,4]
[null,5]
[null,6]
[null,7]
[null,8]
[null,9]
[null,10]
[null,11]
[null,12]
[null,13]
[null,14]
[null,15]
[null,16]
[null,17]
[null,18]
[null,"Observaciones generales: "]
[]
[null,null,"Nota: Tener en cuenta los siguientes aspectos para efectuar la calificación:"]
[null,null,"i) La planeación institucional enmarcada en la visión, misión y objetivos del organismo; "]
[null,null,"ii) Los objetivos institucionales por dependencia y sus compromisos relacionados y; "]
[null,null,"iii) Los resultados de la ejecución por dependencias de acuerdo con lo  programado en la planeación institucional."]
[null,"En el evento de detectar limitaciones de orden presupuestal o administrativo, se deben describir los aspectos más relevantes que hayan afectado la ejecución de los planes institucionales en cada dependencia."]

{"sheet":"F6. REPOR CLF PRD SEMESTRAL","index":7,"n_rows":88,"n_cols":18,"rows_kept":88,"cut":false,"hidden":false,"merged":[[43,0,44,5],[43,6,44,12],[43,16,44,18],[32,3,33,5],[34,3,35,5],[36,3,37,5],[28,17,29,18],[30,13,31,14],[30,15,31,16],[30,17,31,18],[28,13,29,14],[28,15,29,16],[30,8,31,12],[31,0,31,6],[30,0,30,6],[27,0,27,7],[23,15,23,18],[25,0,25,5],[25,6,25,12],[25,13,25,14],[25,15,25,16],[25,17,25,18],[24,13,24,14],[24,15,24,16],[24,17,24,18],[24,0,24,5],[24,6,24,12],[23,0,23,1],[23,2,23,4],[23,5,23,7],[23,8,23,10],[23,11,23,14],[26,0,26,18],[27,13,27,18],[27,8,29,12],[28,0,29,7],[78,9,79,15],[78,16,79,17],[82,16,82,17],[72,9,73,15],[72,16,73,17],[74,9,75,15],[74,16,75,17],[76,9,77,15],[76,16,77,17],[68,9,68,15],[68,16,68,17],[69,9,69,15],[69,16,69,17],[70,9,71,15],[70,16,71,17],[61,0,61,18],[66,9,66,15],[66,16,66,17],[67,9,67,15],[67,16,67,17],[58,0,60,2],[58,3,60,3],[58,4,60,6],[58,11,60,14],[58,7,60,10],[58,15,60,18],[55,0,55,18],[56,0,56,18],[34,19,35,19],[36,19,37,19],[43,13,44,15],[41,0,41,18],[38,0,38,18],[39,0,40,18],[50,0,51,3],[52,0,54,3],[45,0,46,3],[47,0,49,3],[50,4,51,18],[52,4,54,18],[45,4,46,18],[47,4,49,18],[57,0,57,18],[42,0,42,18],[9,0,9,18],[11,0,11,1],[11,2,11,4],[11,5,11,7],[11,8,11,10],[11,11,11,14],[11,15,11,18],[13,0,13,7],[13,8,13,18],[12,0,12,7],[12,8,12,18],[10,0,10,1],[10,2,10,4],[10,5,10,7],[10,8,10,10],[10,11,10,14],[10,15,10,18],[22,0,22,1],[22,2,22,4],[22,5,22,7],[22,8,22,10],[22,11,22,14],[22,15,22,18],[20,0,20,5],[20,6,20,12],[20,13,20,14],[20,15,20,16],[20,17,20,18],[21,0,21,18],[14,0,14,4],[14,5,14,6],[14,8,15,10],[14,11,15,18],[19,13,19,14],[19,15,19,16],[19,17,19,18],[19,0,19,5],[19,6,19,12],[18,0,18,1],[18,2,18,4],[18,5,18,7],[18,8,18,10],[18,11,18,14],[18,15,18,18],[17,0,17,1],[17,2,17,4],[17,5,17,7],[17,8,17,10],[17,11,17,14],[17,15,17,18],[15,0,15,4],[15,5,15,6],[16,0,16,18],[1,0,8,2],[1,3,2,15],[1,16,8,18],[3,3,4,15],[5,3,8,8],[6,9,7,13],[6,14,7,15],[8,9,8,13],[8,14,8,15],[5,9,5,11],[5,12,5,13],[5,14,5,15]]}
[]
[null,null,null,"COMISIÓN NACIONAL DEL SERVICIO CIVIL \n    "]
[]
[null,null,null,"FORMATO 6. REPORTE DE CALIFICACIÓN PERÍODO SEMESTRAL U ORDINARIO"]
[]
[null,null,null,"PROCESO: EVALUACIÓN DEL DESEMPEÑO LABORAL",null,null,null,null,null,"CÓDIGO:  ",null,null,"F-ED-007",null,"Página: 1 de 1"]
[null,null,null,null,null,null,null,null,null,"FECHA EMISIÓN",null,null,null,null,"2016-02-10"]
[]
[null,null,null,null,null,null,null,null,null,"Versión ",null,null,null,null,"1.0"]
["I. IDENTIFICACIÓN DEL EVALUADO"]
["Tipo de Documento",null,"Número de identificación",null,null,"Primer apellido",null,null,"Segundo apellido",null,null,"Primer nombre",null,null,null,"Otros nombres"]
[{"$f":"'F2. COMP. LAB Y COM COMPOR'!A13:B13","v":"CÉDULA DE CIUDADANÍA"},null,{"$f":"'F2. COMP. LAB Y COM COMPOR'!C13:E13","v":0},null,null,{"$f":"'F2. COMP. LAB Y COM COMPOR'!F13:H13","v":""},null,null,{"$f":"'F2. COMP. LAB Y COM COMPOR'!I13:K13","v":""},null,null,{"$f":"'F2. COMP. LAB Y COM COMPOR'!L13:O13","v":""},null,null,null,{"$f":"'F2. COMP. LAB Y COM COMPOR'!P13:S13","v":""}]
["Dependencia o área a la que pertenece el evaluado",null,null,null,null,null,null,null,"Denominación del empleo"]
[{"$f":"'F2. COMP. LAB Y COM COMPOR'!A15:H15","v":""},null,null,null,null,null,null,null,{"$f":"'F2. COMP. LAB Y COM COMPOR'!I15:S15","v":""}]
["Nivel jerárquico",null,null,null,null,"Código",null,"Grado",{"$f":"'F2. COMP. LAB Y COM COMPOR'!I16","v":"Propósito del empleo:"},null,null,{"$f":"'F2. COMP. LAB Y COM COMPOR'!J16","v":0}]
[{"$f":"'F2. COMP. LAB Y COM COMPOR'!A17:E17","v":""},null,null,null,null,{"$f":"'F2. COMP. LAB Y COM COMPOR'!F17:G17","v":""},null,{"$f":"'F2. COMP. LAB Y COM COMPOR'!H17","v":""}]
["II. IDENTIFICACIÓN EVALUADOR. (Jefe inmediato)"]
["Tipo de documento",null,"Número de identificación",null,null,"Primer apellido",null,null,"Segundo apellido",null,null,"Primer nombre",null,null,null,"Otros nombres"]
[{"$f":"'F2. COMP. LAB Y COM COMPOR'!A20:B20","v":"CEDULA DE CIUDADANIA"},null,{"$f":"'F2. COMP. LAB Y COM COMPOR'!C20:E20","v":0},null,null,{"$f":"'F2. COMP. LAB Y COM COMPOR'!F20:H20","v":""},null,null,{"$f":"'F2. COMP. LAB Y COM COMPOR'!I20:K20","v":""},null,null,{"$f":"'F2. COMP. LAB Y COM COMPOR'!L20:O20","v":""},null,null,null,{"$f":"'F2. COMP. LAB Y COM COMPOR'!P20:S20","v":""}]
[" Área o Dependencia a la que pertenece el evaluador",null,null,null,null,null,"Denominación del empleo",null,null,null,null,null,null,"Código",null,"Grado",null,"Nivel jerárquico"]
[{"$f":"'F2. COMP. LAB Y COM COMPOR'!A22:F22","v":""},null,null,null,null,null,{"$f":"'F2. COMP. LAB Y COM COMPOR'!G22:M22","v":""},null,null,null,null,null,null,{"$f":"'F2. COMP. LAB Y COM COMPOR'!N22:O22","v":""},null,{"$f":"'F2. COMP. LAB Y COM COMPOR'!P22:Q22","v":""},null,{"$f":"'F2. COMP. LAB Y COM COMPOR'!R22:S22","v":""}]
["III. IDENTIFICACIÓN EVALUADOR (Servidor público de Libre Nombramiento y Remoción en caso de constituir Comisión Evaluadora)"]
["Tipo de documento",null,"Número de identificación",null,null,"Primer apellido",null,null,"Segundo apellido",null,null,"Primer nombre",null,null,null,"Otros nombres"]
[{"$f":"'F2. COMP. LAB Y COM COMPOR'!$A$25:$B$25","v":"CEDULA DE CIUDADANIA"},null,{"$f":"'F2. COMP. LAB Y COM COMPOR'!$C$25:$E$25","v":0},null,null,{"$f":"'F2. COMP. LAB Y COM COMPOR'!$F$25:$H$25","v":""},null,null,{"$f":"'F2. COMP. LAB Y COM COMPOR'!$I$25:$K$25","v":""},null,null,{"$f":"'F2. COMP. LAB Y COM COMPOR'!$L$25:$O$25","v":""},null,null,null,{"$f":"'F2. COMP. LAB Y COM COMPOR'!$P$25:$S$25","v":""}]
["Dependencia o área a la que pertenece el evaluador",null,null,null,null,null,"Denominación del empleo",null,null,null,null,null,null,"Código",null,"Grado",null,"Nivel jerárquico"]
[{"$f":"'F2. COMP. LAB Y COM COMPOR'!$A$27:$F$27","v":""},null,null,null,null,null,{"$f":"'F2. COMP. LAB Y COM COMPOR'!$G$27:$M$27","v":""},null,null,null,null,null,null,{"$f":"'F2. COMP. LAB Y COM COMPOR'!$N$27:$O$27","v":""},null,{"$f":"'F2. COMP. LAB Y COM COMPOR'!$P$27:$Q$27","v":""},null,{"$f":"'F2. COMP. LAB Y COM COMPOR'!$R$27:$S$27","v":""}]
["IV. CONSOLIDACIÓN DE LAS EVALUACIONES"]
["EVALUACIÓN INDIVIDUAL SEMESTRAL",null,null,null,null,null,null,null,"EVALUACIÓN DE GESTIÓN POR ÁREAS O DEPENDENCIAS (/10)",null,null,null,null,"CALIFICACIÓN DEFINITIVA"]
["CALIFICACIÓN SEMESTRAL",null,null,null,null,null,null,null,null,null,null,null,null,"FECHA DE NOTIFICACIÓN",null,"CALIFICACIÓN DEFINITIVA\n",null,"NIVEL"]
[]
["Compromisos laborales (sobre 100)",null,null,null,null,null,null,{"$f":"IF('F1. INF. GENERAL'!P43=\"\",'F1. INF. GENERAL'!P44,'F1. INF. GENERAL'!P43)","v":0},{"$f":"+'F1. INF. GENERAL'!P50","v":0},null,null,null,null,null,null,{"$f":"'F1. INF. GENERAL'!L55","v":0},null,{"$f":"'F1. INF. GENERAL'!P55","v":"NO APLICA CALIFICACION"}]
["Competencias comportamentales(/10)",null,null,null,null,null,null,{"$f":"IF('F1. INF. GENERAL'!F55=0,'F1. INF. GENERAL'!F56,'F1. INF. GENERAL'!F55)","v":0}]
[null,null,null,"Firma del  Evaluado"]
[]
[null,null,null,"Firma del Jefe Inmediato"]
[]
[null,null,null,"Firma del Evaluador de LNR "]
[]
["INTERPONE RECURSOS"]
[]
[]
["V. DECISIÓN DE RECURSOS"]
["RECURSO DE REPOSICIÓN"]
["DECISIÓN",null,null,null,null,null,null,null,null,null,null,null,null,"FECHA"]
[]
["Nombre del Evaluado:",null,null,null,{"$f":"IF(A40=\"SI\",CONCATENATE('F2. COMP. LAB Y COM COMPOR'!L13,\" \",'F2. COMP. LAB Y COM COMPOR'!P13,\" \",'F2. COMP. LAB Y COM COMPOR'!F13,\" \",'F2. COMP. LAB Y COM COMPOR'!I13),\"\")","v":""}]
[]
["Firma"]
[]
[]
["Nombre del Notificador:"]
[]
["Firma"]
[]
[]
["MOTIVACIÓN (podrá relacionar anexos):"]
[]
["VI. CALIFICACIÓN DEFINITIVA"]
["CALIFICACIÓN DEFINITIVA EN FIRME",null,null,null,"FIRMA Y NÚMERO DE CÉDULA DEL NOTIFICADO",null,null,null,null,null,null,"FIRMA Y NÚMERO DE CÉDULA DEL NOTIFICADOR"]
[]
[]
[]
[]
[]
[null,"SI",null,null,null,null,null,"CUMPLE"]
[null,"NO",null,null,null,null,null,"NO CUMPLE",null,"Contador de Cumplimiento"]
[null,null,null,null,null,null,null,"NO APLICA",null,"FACTORES DEL NIVEL SOBRESALIENTE",null,null,null,null,null,null,"CUMPLIMIENTO"]
["Cedula de ciudadanía",null,null,null,null,null,null,null,null,"Evaluación de la Gestión por Dependencias",null,null,null,null,null,null,{"$f":"IF(#REF!=\"Cumple\",1,0)","v":{"$error":"#REF!"}}]
["Cedula de extranjería",null,null,null,null,null,null,null,null,"Por calidad y oportunidad",null,null,null,null,null,null,{"$f":"IF(#REF!=\"Cumple\",1,0)","v":{"$error":"#REF!"}}]
[null,null,null,null,null,null,null,null,null,"Por aportes, propuestas o iniciativas adicionales",null,null,null,null,null,null,{"$f":"IF(#REF!=\"Cumple\",1,0)","v":{"$error":"#REF!"}}]
[null,null,null,null,null,null,null,null,null,"Por iniciativas tendientes a acciones proactivas en las actividades que cumplió",null,null,null,null,null,null,{"$f":"IF(#REF!=\"Cumple\",1,0)","v":{"$error":"#REF!"}}]
[]
[null,null,null,null,null,null,null,null,null,"Por participación y aprovechamiento de capacitación relacionada con las actividades propias del empleo y que genere un valor agregado para la entidad o la dependencia",null,null,null,null,null,null,{"$f":"IF(#REF!=\"Cumple\",1,0)","v":{"$error":"#REF!"}}]
[]
[null,null,null,null,null,null,null,null,null,"Por participación en grupos o en actividades que requieren de disposición voluntaria",null,null,null,null,null,null,{"$f":"IF(#REF!=\"Cumple\",1,0)","v":{"$error":"#REF!"}}]
[]
[null,null,null,null,null,null,null,null,null,null,null,null,null,null,null,null,{"$f":"IF(#REF!=\"Cumple\",1,0)","v":{"$error":"#REF!"}}]
[]
[null,null,null,null,null,null,null,null,null,null,null,null,null,null,null,null,{"$f":"IF(#REF!=\"Cumple\",1,0)","v":{"$error":"#REF!"}}]
[]
[]
[]
[null,null,null,null,null,null,null,null,null,null,null,null,null,null,null,null,{"$f":"SUM(Q68:R80)","v":{"$error":"#REF!"}}]
[]
[]
[null,null,null,null,null,null,null,null,null,null,null,null,null,null,null,null,"CRITERIO DE ORIENTACIÓN"]
[null,null,null,null,null,null,null,null,null,null,null,null,null,null,null,null,"CUMPLE"]
[null,null,null,null,null,null,null,null,null,null,null,null,null,null,null,null,"NO CUMPLE"]

{"sheet":"F7. PLAN DE MEJORAMIENTO","index":8,"n_rows":62,"n_cols":18,"rows_kept":62,"cut":false,"hidden":false,"merged":[[60,0,60,18],[61,0,64,1],[61,2,64,3],[61,4,64,6],[61,7,64,9],[61,10,64,12],[61,13,64,16],[61,17,62,18],[63,17,64,18],[58,0,59,2],[58,3,59,5],[58,6,59,11],[58,12,59,15],[58,16,59,16],[58,17,59,18],[56,0,57,2],[56,3,57,5],[56,6,57,11],[56,12,57,15],[56,16,57,16],[56,17,57,18],[54,0,55,2],[54,3,55,5],[54,6,55,11],[54,12,55,15],[54,16,55,16],[54,17,55,18],[52,0,53,2],[52,3,53,5],[52,6,53,11],[52,12,53,15],[52,16,53,16],[52,17,53,18],[50,0,51,2],[50,3,51,5],[50,6,51,11],[50,12,51,15],[50,16,51,16],[50,17,51,18],[48,0,49,2],[48,3,49,5],[48,6,49,11],[48,12,49,15],[48,16,49,16],[48,17,49,18],[46,0,47,2],[46,3,47,5],[46,6,47,11],[46,12,47,15],[46,16,47,16],[46,17,47,18],[44,0,45,2],[44,3,45,5],[44,6,45,11],[44,12,45,15],[44,16,45,16],[44,17,45,18],[42,0,43,2],[42,3,43,5],[42,6,43,11],[42,12,43,15],[42,16,43,16],[42,17,43,18],[40,0,41,2],[40,3,41,5],[40,6,41,11],[40,12,41,15],[40,16,41,16],[40,17,41,18],[38,0,39,2],[38,3,39,5],[38,6,39,11],[38,12,39,15],[38,16,39,16],[38,17,39,18],[36,0,37,2],[36,3,37,5],[36,6,37,11],[36,12,37,15],[36,16,37,16],[36,17,37,18],[34,0,35,2],[34,3,35,5],[34,6,35,11],[34,12,35,15],[34,16,35,16],[34,17,35,18],[32,0,33,2],[32,3,33,5],[32,6,33,11],[32,12,33,15],[32,16,33,16],[32,17,33,18],[30,0,31,2],[30,3,31,5],[30,6,31,11],[30,12,31,15],[30,16,31,16],[30,17,31,18],[28,0,29,2],[28,3,29,5],[28,6,29,11],[28,12,29,15],[28,16,29,16],[28,17,29,18],[25,0,25,18],[26,0,27,2],[26,3,27,5],[26,6,27,11],[26,12,27,15],[26,16,27,16],[26,17,27,18],[23,0,23,5],[23,6,23,12],[23,13,23,14],[23,15,23,16],[23,17,23,18],[24,0,24,5],[24,6,24,12],[24,13,24,14],[24,15,24,16],[24,17,24,18],[22,0,22,1],[22,2,22,4],[22,5,22,7],[22,8,22,10],[22,11,22,14],[22,15,22,18],[20,0,20,18],[21,0,21,1],[21,2,21,4],[21,5,21,7],[21,8,21,10],[21,11,21,14],[21,15,21,18],[18,0,18,5],[18,6,18,12],[18,13,18,14],[18,15,18,16],[18,17,18,18],[19,0,19,5],[19,6,19,12],[19,13,19,14],[19,15,19,16],[19,17,19,18],[17,0,17,1],[17,2,17,4],[17,5,17,7],[17,8,17,10],[17,11,17,14],[17,15,17,18],[15,0,15,18],[16,0,16,1],[16,2,16,4],[16,5,16,7],[16,8,16,10],[16,11,16,14],[16,15,16,18],[11,0,11,7],[11,8,11,18],[12,0,12,7],[12,8,12,18],[13,0,13,4],[13,5,13,6],[14,0,14,4],[14,5,14,6],[13,8,14,9],[13,10,14,18],[10,0,10,1],[10,2,10,4],[10,5,10,7],[10,8,10,10],[10,11,10,14],[10,15,10,18],[7,13,7,16],[8,0,8,18],[9,0,9,1],[9,2,9,4],[9,5,9,7],[9,8,9,10],[9,11,9,14],[9,15,9,18],[1,0,7,2],[1,3,3,16],[1,17,7,18],[4,3,5,16],[6,3,7,7],[6,8,6,10],[6,11,6,12],[6,13,6,14],[6,15,6,16],[7,8,7,12]]}
[]
[null,null,null,"\nCOMISIÓN NACIONAL DEL SERVICIO CIVIL\n     "]
[]
[]
[null,null,null,"FORMATO 7. PLAN DE MEJORAMIENTO"]
[]
[null,null,null,"PROCESO: EVALUACIÓN DEL DESEMPEÑO LABORAL",null,null,null,null,"CÓDIGO:  ",null,null,"F-ED-008",null,"FECHA EMISIÓN: ",null,"2016-02-10"]
[null,null,null,null,null,null,null,null,"Página: 1 de 1.",null,null,null,null,"Versión:   1.0"]
["I. IDENTIFICACIÓN DEL EVALUADO"]
["Tipo de Documento",null,"Número de identificación",null,null,"Primer apellido",null,null,"Segundo apellido",null,null,"Primer nombre",null,null,null,"Otros nombres"]
[{"$f":"'F2. COMP. LAB Y COM COMPOR'!A13:B13","v":"CÉDULA DE CIUDADANÍA"},null,{"$f":"'F2. COMP. LAB Y COM COMPOR'!C13:E13","v":0},null,null,{"$f":"'F2. COMP. LAB Y COM COMPOR'!F13:H13","v":""},null,null,{"$f":"'F2. COMP. LAB Y COM COMPOR'!I13:K13","v":""},null,null,{"$f":"'F2. COMP. LAB Y COM COMPOR'!L13:O13","v":""},null,null,null,{"$f":"'F2. COMP. LAB Y COM COMPOR'!P13:S13","v":""}]
["Dependencia o área a la que pertenece el evaluado",null,null,null,null,null,null,null,"Denominación del empleo"]
[{"$f":"'F2. COMP. LAB Y COM COMPOR'!A15:H15","v":""},null,null,null,null,null,null,null,{"$f":"'F2. COMP. LAB Y COM COMPOR'!I15:S15","v":""}]
["Nivel jerárquico",null,null,null,null,"Código",null,"Grado","Propósito del empleo",null,{"$f":"'F2. COMP. LAB Y COM COMPOR'!J16","v":0}]
[{"$f":"'F2. COMP. LAB Y COM COMPOR'!A17:E17","v":""},null,null,null,null,{"$f":"'F2. COMP. LAB Y COM COMPOR'!F17:G17","v":""},null,{"$f":"'F2. COMP. LAB Y COM COMPOR'!H17","v":""}]
["II. IDENTIFICACIÓN EVALUADOR. (Jefe inmediato)"]
["Tipo de documento",null,"Número de identificación",null,null,"Primer apellido",null,null,"Segundo apellido",null,null,"Primer nombre",null,null,null,"Otros nombres"]
[{"$f":"'F2. COMP. LAB Y COM COMPOR'!A20:B20","v":"CEDULA DE CIUDADANIA"},null,{"$f":"'F2. COMP. LAB Y COM COMPOR'!C20:E20","v":0},null,null,{"$f":"'F2. COMP. LAB Y COM COMPOR'!F20:H20","v":""},null,null,{"$f":"'F2. COMP. LAB Y COM COMPOR'!I20:K20","v":""},null,null,{"$f":"'F2. COMP. LAB Y COM COMPOR'!L20:O20","v":""},null,null,null,{"$f":"'F2. COMP. LAB Y COM COMPOR'!P20:S20","v":""}]
[" Área o Dependencia a la que pertenece el evaluador",null,null,null,null,null,"Denominación del empleo",null,null,null,null,null,null,"Código",null,"Grado",null,"Nivel jerárquico"]
[{"$f":"'F2. COMP. LAB Y COM COMPOR'!A22:F22","v":""},null,null,null,null,null,{"$f":"'F2. COMP. LAB Y COM COMPOR'!G22:M22","v":""},null,null,null,null,null,null,{"$f":"'F2. COMP. LAB Y COM COMPOR'!N22:O22","v":""},null,{"$f":"'F2. COMP. LAB Y COM COMPOR'!P22:Q22","v":""},null,{"$f":"'F2. COMP. LAB Y COM COMPOR'!R22:S22","v":""}]
["III. IDENTIFICACIÓN EVALUADOR (Servidor público de Libre Nombramiento y Remoción en caso de constituir Comisión Evaluadora)"]
["Tipo de documento",null,"Número de identificación",null,null,"Primer apellido",null,null,"Segundo apellido",null,null,"Primer nombre",null,null,null,"Otros nombres"]
[{"$f":"'F2. COMP. LAB Y COM COMPOR'!A25:B25","v":"CEDULA DE CIUDADANIA"},null,{"$f":"'F2. COMP. LAB Y COM COMPOR'!C25:E25","v":0},null,null,{"$f":"'F2. COMP. LAB Y COM COMPOR'!F25:H25","v":""},null,null,{"$f":"'F2. COMP. LAB Y COM COMPOR'!I25:K25","v":""},null,null,{"$f":"'F2. COMP. LAB Y COM COMPOR'!L25:O25","v":""},null,null,null,{"$f":"'F2. COMP. LAB Y COM COMPOR'!P25:S25","v":""}]
["Dependencia o área a la que pertenece el evaluador",null,null,null,null,null,"Denominación del empleo",null,null,null,null,null,null,"Código",null,"Grado",null,"Nivel jerárquico"]
[{"$f":"'F2. COMP. LAB Y COM COMPOR'!A27:F27","v":""},null,null,null,null,null,{"$f":"'F2. COMP. LAB Y COM COMPOR'!G27:M27","v":""},null,null,null,null,null,null,{"$f":"'F2. COMP. LAB Y COM COMPOR'!N27:O27","v":""},null,{"$f":"'F2. COMP. LAB Y COM COMPOR'!P27:Q27","v":""},null,{"$f":"'F2. COMP. LAB Y COM COMPOR'!R27:S27","v":""}]
["IV. PLAN DE MEJORAMIENTO INDIVIDUAL DEL EMPLEADO PÚBLICO"]
["Componente de evaluación",null,null,"Descripción",null,null,"Aspectos a corregir ",null,null,null,null,null,"Acción de mejoramiento",null,null,null,"Periodo","Observaciones"]
[]
[null,null,null,{"$f":"IFERROR(VLOOKUP(A29,Hoja4!A459:B474,2,FALSE),0)","v":0}]
[]
[null,null,null,{"$f":"IFERROR(VLOOKUP(A31,Hoja4!A461:B476,2,FALSE),0)","v":0}]
[]
[null,null,null,{"$f":"IFERROR(VLOOKUP(A33,Hoja4!A463:B478,2,FALSE),0)","v":0}]
[]
[null,null,null,{"$f":"IFERROR(VLOOKUP(A35,Hoja4!A465:B480,2,FALSE),0)","v":0}]
[]
[null,null,null,{"$f":"IFERROR(VLOOKUP(A37,Hoja4!A467:B482,2,FALSE),0)","v":0}]
[]
[null,null,null,{"$f":"IFERROR(VLOOKUP(A39,Hoja4!A469:B484,2,FALSE),0)","v":0}]
[]
[null,null,null,{"$f":"IFERROR(VLOOKUP(A41,Hoja4!A471:B486,2,FALSE),0)","v":0}]
[]
[null,null,null,{"$f":"IFERROR(VLOOKUP(A43,Hoja4!A473:B488,2,FALSE),0)","v":0}]
[]
[null,null,null,{"$f":"IFERROR(VLOOKUP(A45,Hoja4!A475:B490,2,FALSE),0)","v":0}]
[]
[null,null,null,{"$f":"IFERROR(VLOOKUP(A47,Hoja4!A477:B492,2,FALSE),0)","v":0}]
[]
[null,null,null,{"$f":"IFERROR(VLOOKUP(A49,Hoja4!A479:B494,2,FALSE),0)","v":0}]
[]
[null,null,null,{"$f":"IFERROR(VLOOKUP(A51,Hoja4!A481:B496,2,FALSE),0)","v":0}]
[]
[null,null,null,{"$f":"IFERROR(VLOOKUP(A53,Hoja4!A483:B498,2,FALSE),0)","v":0}]
[]
[null,null,null,{"$f":"IFERROR(VLOOKUP(A55,Hoja4!A485:B500,2,FALSE),0)","v":0}]
[]
[null,null,null,{"$f":"IFERROR(VLOOKUP(A57,Hoja4!A487:B502,2,FALSE),0)","v":0}]
[]
[null,null,null,{"$f":"IFERROR(VLOOKUP(A59,Hoja4!A489:B504,2,FALSE),0)","v":0}]
[]
["V. FORMALIZACIÒN DEL PLAN DE MEJORAMIENTO"]
["EVALUADO",null,"NOMBRE, FIRMA Y NÚMERO DE CÉDULA.",null,null,null,null,"EVALUADOR",null,null,"NOMBRE, FIRMA Y NÚMERO DE CÉDULA.",null,null,null,null,null,null,"FECHA DE DILIGENCIAMIENTO"]

{"sheet":"F8. EVA. EVENTUAL","index":9,"n_rows":73,"n_cols":20,"rows_kept":73,"cut":false,"hidden":false,"merged":[[24,0,24,5],[24,6,24,12],[24,13,24,14],[24,15,24,16],[24,17,24,18],[25,0,25,5],[25,6,25,12],[25,13,25,14],[25,15,25,16],[25,17,25,18],[21,0,21,18],[23,0,23,1],[23,2,23,4],[23,5,23,7],[23,8,23,10],[23,11,23,14],[23,15,23,18],[22,0,22,1],[22,2,22,4],[22,5,22,7],[22,8,22,10],[22,11,22,14],[22,15,22,18],[16,0,16,18],[18,0,18,1],[18,2,18,4],[18,5,18,7],[18,8,18,10],[18,11,18,14],[18,15,18,18],[20,0,20,5],[20,6,20,12],[20,13,20,14],[20,15,20,16],[20,17,20,18],[17,5,17,7],[17,8,17,10],[17,11,17,14],[17,15,17,18],[19,0,19,5],[19,13,19,14],[19,15,19,16],[19,17,19,18],[19,6,19,12],[17,0,17,1],[17,2,17,4],[11,0,11,1],[11,2,11,4],[11,5,11,7],[11,8,11,10],[11,11,11,14],[11,15,11,18],[15,0,15,4],[15,5,15,6],[12,0,12,7],[12,8,12,18],[13,0,13,7],[13,8,13,18],[14,0,14,4],[14,5,14,6],[14,8,15,9],[14,10,15,18],[0,0,5,3],[0,4,1,14],[0,15,6,18],[2,4,3,14],[4,4,5,6],[6,4,6,14],[4,7,4,8],[4,9,4,10],[4,11,4,12],[4,13,4,14],[5,7,5,8],[5,9,5,10],[5,11,5,12],[5,13,5,14],[7,0,8,3],[7,7,8,8],[7,12,8,15],[10,0,10,1],[10,2,10,4],[10,5,10,7],[10,8,10,10],[10,11,10,14],[10,15,10,18],[9,0,9,18],[27,0,30,3],[27,4,30,9],[27,10,30,11],[26,0,26,18],[27,12,28,18],[29,12,30,12],[29,13,30,13],[29,14,30,14],[29,15,30,15],[29,16,30,16],[29,17,30,17],[29,18,30,18],[33,0,34,3],[33,4,34,9],[33,10,34,11],[31,0,32,3],[31,4,32,9],[31,10,32,11],[33,17,34,17],[33,18,34,18],[31,17,32,17],[31,18,32,18],[31,15,32,15],[31,16,32,16],[33,16,34,16],[31,12,32,12],[33,12,34,12],[31,13,32,13],[33,13,34,13],[31,14,32,14],[33,14,34,14],[33,15,34,15],[37,0,38,3],[37,4,38,9],[37,10,38,11],[35,0,36,3],[35,4,36,9],[35,10,36,11],[35,16,36,16],[35,17,36,17],[35,18,36,18],[37,16,38,16],[37,17,38,17],[37,18,38,18],[35,12,36,12],[37,12,38,12],[35,13,36,13],[37,13,38,13],[35,14,36,14],[35,15,36,15],[37,14,38,14],[37,15,38,15],[41,0,41,9],[41,10,41,11],[44,0,44,9],[39,0,40,3],[39,4,40,9],[39,10,40,11],[39,16,40,16],[39,17,40,17],[39,18,40,18],[42,0,43,5],[44,10,44,18],[42,6,42,10],[39,14,40,14],[39,15,40,15],[43,6,43,10],[39,12,40,12],[39,13,40,13],[41,18,43,18],[45,0,45,9],[45,10,45,18],[63,0,65,3],[78,20,79,21],[61,0,62,3],[76,19,77,19],[80,20,81,21],[76,20,77,21],[48,0,49,1],[47,0,47,1],[52,0,53,1],[50,0,51,1],[54,0,55,1],[47,2,47,4],[48,2,49,4],[50,2,51,4],[52,2,53,4],[46,0,46,18],[54,2,55,4],[47,5,47,11],[48,5,49,11],[50,5,51,11],[52,5,53,11],[54,5,55,11],[48,18,49,18],[50,18,51,18],[52,18,53,18],[54,18,55,18],[57,0,57,11],[58,0,59,11],[58,12,59,18],[56,0,56,11],[82,20,82,21],[68,0,69,3],[70,0,71,3],[66,0,67,3],[72,0,74,3],[60,12,67,15],[68,12,74,15],[60,16,67,18],[68,16,74,18],[60,0,60,11],[61,10,61,11],[62,10,74,11],[61,4,65,9],[66,4,69,9],[70,4,74,9],[56,18,57,18]]}
[null,null,null,null,"COMISIÓN NACIONAL DEL SERVICIO CIVIL"]
[]
[null,null,null,null,"FORMATO 8. EVALUACIÓN PARCIAL EVENTUAL"]
[]
[null,null,null,null,"PROCESO: EVALUACIÓN DEL DESEMPEÑO LABORAL",null,null,"Código:  ",null,"F-ED-009",null,"Página",null,"1 de 1"]
[null,null,null,null,null,null,null,"Fecha de emisión: ",null,"2016-02-10",null,"Versión: ",null,"1.0"]
[]
["PERÍODO DE EVALUACIÓN",null,null,null,"DÍA","MES","AÑO","al",null,"DÍA","MES","AÑO","FECHA DE CALIFICACIÓN",null,null,null,"DÍA","MES","AÑO"]
[]
["I. IDENTIFICACIÓN DEL EVALUADO"]
["Tipo de Documento",null,"Número de identificación",null,null,"Primer apellido",null,null,"Segundo apellido",null,null,"Primer nombre",null,null,null,"Otros nombres"]
[{"$f":"'F2. COMP. LAB Y COM COMPOR'!A13:B13","v":"CÉDULA DE CIUDADANÍA"},null,{"$f":"'F2. COMP. LAB Y COM COMPOR'!C13:E13","v":0},null,null,{"$f":"'F2. COMP. LAB Y COM COMPOR'!F13:H13","v":""},null,null,{"$f":"'F2. COMP. LAB Y COM COMPOR'!I13:K13","v":""},null,null,{"$f":"'F2. COMP. LAB Y COM COMPOR'!L13:O13","v":""},null,null,null,{"$f":"'F2. COMP. LAB Y COM COMPOR'!P13:S13","v":""}]
["Dependencia o área a la que pertenece el evaluado",null,null,null,null,null,null,null,"Denominación del empleo"]
[{"$f":"'F2. COMP. LAB Y COM COMPOR'!A15:H15","v":""},null,null,null,null,null,null,null,{"$f":"'F2. COMP. LAB Y COM COMPOR'!I15:S15","v":""}]
["Nivel jerárquico",null,null,null,null,"Código",null,"Grado",{"$f":"'F2. COMP. LAB Y COM COMPOR'!I16","v":"Propósito del empleo:"},null,{"$f":"'F2. COMP. LAB Y COM COMPOR'!J16","v":0}]
[{"$f":"'F2. COMP. LAB Y COM COMPOR'!A17:E17","v":""},null,null,null,null,{"$f":"'F2. COMP. LAB Y COM COMPOR'!F17:G17","v":""},null,{"$f":"'F2. COMP. LAB Y COM COMPOR'!H17","v":""}]
["II. IDENTIFICACIÓN EVALUADOR. (Jefe inmediato)"]
["Tipo de documento",null,"Número de identificación",null,null,"Primer apellido",null,null,"Segundo apellido",null,null,"Primer nombre",null,null,null,"Otros nombres"]
[{"$f":"'F2. COMP. LAB Y COM COMPOR'!A20:B20","v":"CEDULA DE CIUDADANIA"},null,{"$f":"'F2. COMP. LAB Y COM COMPOR'!C20:E20","v":0},null,null,{"$f":"'F2. COMP. LAB Y COM COMPOR'!F20:H20","v":""},null,null,{"$f":"'F2. COMP. LAB Y COM COMPOR'!I20:K20","v":""},null,null,{"$f":"'F2. COMP. LAB Y COM COMPOR'!L20:O20","v":""},null,null,null,{"$f":"'F2. COMP. LAB Y COM COMPOR'!P20:S20","v":""}]
[" Área o Dependencia a la que pertenece el evaluador",null,null,null,null,null,"Denominación del empleo",null,null,null,null,null,null,"Código",null,"Grado",null,"Nivel jerárquico"]
[{"$f":"'F2. COMP. LAB Y COM COMPOR'!A22:F22","v":""},null,null,null,null,null,{"$f":"'F2. COMP. LAB Y COM COMPOR'!G22:M22","v":""},null,null,null,null,null,null,{"$f":"'F2. COMP. LAB Y COM COMPOR'!N22:O22","v":""},null,{"$f":"'F2. COMP. LAB Y COM COMPOR'!P22:Q22","v":""},null,{"$f":"'F2. COMP. LAB Y COM COMPOR'!R22:S22","v":""}]
["III. IDENTIFICACIÓN EVALUADOR (Servidor público de Libre Nombramiento y Remoción en caso de constituir Comisión Evaluadora)"]
["Tipo de documento",null,"Número de identificación",null,null,"Primer apellido",null,null,"Segundo apellido",null,null,"Primer nombre",null,null,null,"Otros nombres"]
[{"$f":"'F2. COMP. LAB Y COM COMPOR'!A25:B25","v":"CEDULA DE CIUDADANIA"},null,{"$f":"'F2. COMP. LAB Y COM COMPOR'!C25:E25","v":0},null,null,{"$f":"'F2. COMP. LAB Y COM COMPOR'!F25:H25","v":""},null,null,{"$f":"'F2. COMP. LAB Y COM COMPOR'!I25:K25","v":""},null,null,{"$f":"'F2. COMP. LAB Y COM COMPOR'!L25:O25","v":""},null,null,null,{"$f":"'F2. COMP. LAB Y COM COMPOR'!P25:S25","v":""}]
["Dependencia o área a la que pertenece el evaluador",null,null,null,null,null,"Denominación del empleo",null,null,null,null,null,null,"Código",null,"Grado",null,"Nivel jerárquico"]
[{"$f":"'F2. COMP. LAB Y COM COMPOR'!A27:F27","v":""},null,null,null,null,null,{"$f":"'F2. COMP. LAB Y COM COMPOR'!G27:M27","v":""},null,null,null,null,null,null,{"$f":"'F2. COMP. LAB Y COM COMPOR'!N27:O27","v":""},null,{"$f":"'F2. COMP. LAB Y COM COMPOR'!P27:Q27","v":""},null,{"$f":"'F2. COMP. LAB Y COM COMPOR'!R27:S27","v":""}]
["IV. COMPROMISOS LABORALES"]
["Metas de la Dependencia a las cuales contribuye el empleo",null,null,null,"Compromisos Laborales.",null,null,null,null,null,"Peso porcentual del compromiso",null,"Calificación Eventuales"]
[]
[null,null,null,null,null,null,null,null,null,null,null,null,"1ª","2ª","3ª","4ª","5ª","6ª","Total Semestre"]
[]
[{"$f":"'F2. COMP. LAB Y COM COMPOR'!A36","v":0},null,null,null,{"$f":"'F2. COMP. LAB Y COM COMPOR'!H36","v":0},null,null,null,null,null,{"$f":"'F2. COMP. LAB Y COM COMPOR'!Q36","v":0},null,null,null,null,null,null,null,{"$f":"+M32*M$44+N32*N$44+O32*O$44+P32*P$44+Q32*Q$44+R32*R$44","v":0}]
[]
[{"$f":"'F2. COMP. LAB Y COM COMPOR'!A38","v":0},null,null,null,{"$f":"'F2. COMP. LAB Y COM COMPOR'!H38","v":0},null,null,null,null,null,{"$f":"'F2. COMP. LAB Y COM COMPOR'!Q38","v":0},null,null,null,null,null,null,null,{"$f":"+M34*M$44+N34*N$44+O34*O$44+P34*P$44+Q34*Q$44+R34*R$44","v":0}]
[]
[{"$f":"'F2. COMP. LAB Y COM COMPOR'!A40","v":0},null,null,null,{"$f":"'F2. COMP. LAB Y COM COMPOR'!H40","v":0},null,null,null,null,null,{"$f":"'F2. COMP. LAB Y COM COMPOR'!Q40","v":0},null,null,null,null,null,null,null,{"$f":"+M36*M$44+N36*N$44+O36*O$44+P36*P$44+Q36*Q$44+R36*R$44","v":0}]
[]
[{"$f":"'F2. COMP. LAB Y COM COMPOR'!A42","v":0},null,null,null,{"$f":"'F2. COMP. LAB Y COM COMPOR'!H42","v":0},null,null,null,null,null,{"$f":"'F2. COMP. LAB Y COM COMPOR'!Q42","v":0},null,null,null,null,null,null,null,{"$f":"+M38*M$44+N38*N$44+O38*O$44+P38*P$44+Q38*Q$44+R38*R$44","v":0}]
[]
[{"$f":"'F2. COMP. LAB Y COM COMPOR'!A44","v":0},null,null,null,{"$f":"'F2. COMP. LAB Y COM COMPOR'!H44","v":0},null,null,null,null,null,{"$f":"'F2. COMP. LAB Y COM COMPOR'!Q44","v":0},null,null,null,null,null,null,null,{"$f":"+M40*M$44+N40*N$44+O40*O$44+P40*P$44+Q40*Q$44+R40*R$44","v":0}]
[]
["TOTALES",null,null,null,null,null,null,null,null,null,{"$f":"SUM(K32:L41)","v":0},null,{"$f":"+M32*K$32+M34*K$34+M36*K$36+M38*K$38+M40*K$40","v":0},{"$f":"+N32*K$32+N34*K$34+N36*K$36+N38*K$38+N40*K$40","v":0},{"$f":"+O32*K$32+O34*K$34+O36*K$36+O38*K$38+O40*K$40","v":0},{"$f":"+P32*K$32+P34*K$34+P36*K$36+P38*K$38+P40*K$40","v":0},{"$f":"+Q32*K$32+Q34*K$34+Q36*K$36+Q38*K$38+Q40*K$40","v":0},{"$f":"+R32*K$32+R34*K$34+R36*K$36+R38*K$38+R40*K$40","v":0}]
["Días Efectivamente Laborados",null,null,null,null,null,"Total Días Laborados de cada Ev. Eventual",null,null,null,null,{"$f":"IF(SUM(M43:R43)<=30,\"No Aplica\",SUM(M43:R43))","v":"No Aplica"}]
[null,null,null,null,null,null,"% Participación Días Laborados de cada Evaluación. Eventual",null,null,null,null,{"$f":"IFERROR(+L43/$L$43,0)","v":0},{"$f":"IFERROR(+M43/$L$43,0)","v":0},0,0,0,0,0]
["CALIFICACIÓN EVALUACIÓN SEMESTRAL (Sobre 100) ",null,null,null,null,null,null,null,null,null,{"$f":"(+M42*M44+N42*N44+O42*O44+P42*P44+Q42*Q44+R42*R44)","v":0}]
["CALIFICACIÓN TOTAL COMPROMISOS LABORALES",null,null,null,null,null,null,null,null,null,{"$f":"K45*0.8","v":0}]
["V. COMPETENCIAS COMPORTAMENTALES"]
["COMPETENCIA",null,"DEFINICIÓN ",null,null,"CONDUCTAS ASOCIADAS",null,null,null,null,null,null,"1a.","2a.","3a.","4a.","5a.","6a.","Total"]
[{"$f":"'F2. COMP. LAB Y COM COMPOR'!B50","v":0},null,{"$f":"VLOOKUP(A49,Hoja4!A220:C242,2,FALSE)","v":{"$error":"#N/A"}},null,null,{"$f":"VLOOKUP(A49,Hoja4!A$220:C$242,3,FALSE)","v":{"$error":"#N/A"}},null,null,null,null,null,null,null,null,null,null,null,null,{"$f":"+M50*M$58+N50*N$58+O50*O$58+P50*P$58+Q50*Q$58+R50*R$58","v":0}]
[null,null,null,null,null,null,null,null,null,null,null,null,{"$f":"IFERROR(VLOOKUP(M49,Hoja4!$A$246:$B$250,2,FALSE),0)","v":0},{"$f":"IFERROR(VLOOKUP(N49,Hoja4!$A$246:$B$250,2,FALSE),0)","v":0},{"$f":"IFERROR(VLOOKUP(O49,Hoja4!$A$246:$B$250,2,FALSE),0)","v":0},{"$f":"IFERROR(VLOOKUP(P49,Hoja4!$A$246:$B$250,2,FALSE),0)","v":0},{"$f":"IFERROR(VLOOKUP(Q49,Hoja4!$A$246:$B$250,2,FALSE),0)","v":0},{"$f":"IFERROR(VLOOKUP(R49,Hoja4!$A$246:$B$250,2,FALSE),0)","v":0}]
[{"$f":"'F2. COMP. LAB Y COM COMPOR'!B52","v":0},null,{"$f":"VLOOKUP(A51,Hoja4!A$220:C$242,2,FALSE)","v":{"$error":"#N/A"}},null,null,{"$f":"VLOOKUP(A51,Hoja4!A$220:C$242,3,FALSE)","v":{"$error":"#N/A"}},null,null,null,null,null,null,null,null,null,null,null,null,{"$f":"+M52*M$58+N52*N$58+O52*O$58+P52*P$58+Q52*Q$58+R52*R$58","v":0}]
[null,null,null,null,null,null,null,null,null,null,null,null,{"$f":"IFERROR(VLOOKUP(M51,Hoja4!$A$246:$B$250,2,FALSE),0)","v":0},{"$f":"IFERROR(VLOOKUP(N51,Hoja4!$A$246:$B$250,2,FALSE),0)","v":0},{"$f":"IFERROR(VLOOKUP(O51,Hoja4!$A$246:$B$250,2,FALSE),0)","v":0},{"$f":"IFERROR(VLOOKUP(P51,Hoja4!$A$246:$B$250,2,FALSE),0)","v":0},{"$f":"IFERROR(VLOOKUP(Q51,Hoja4!$A$246:$B$250,2,FALSE),0)","v":0},{"$f":"IFERROR(VLOOKUP(R51,Hoja4!$A$246:$B$250,2,FALSE),0)","v":0}]
[{"$f":"'F2. COMP. LAB Y COM COMPOR'!B54","v":0},null,{"$f":"VLOOKUP(A53,Hoja4!A$220:C$242,2,FALSE)","v":{"$error":"#N/A"}},null,null,{"$f":"VLOOKUP(A53,Hoja4!A$220:C$242,3,FALSE)","v":{"$error":"#N/A"}},null,null,null,null,null,null,null,null,null,null,null,null,{"$f":"+M54*M$58+N54*N$58+O54*O$58+P54*P$58+Q54*Q$58+R54*R$58","v":0}]
[null,null,null,null,null,null,null,null,null,null,null,null,{"$f":"IFERROR(VLOOKUP(M53,Hoja4!$A$246:$B$250,2,FALSE),0)","v":0},{"$f":"IFERROR(VLOOKUP(N53,Hoja4!$A$246:$B$250,2,FALSE),0)","v":0},{"$f":"IFERROR(VLOOKUP(O53,Hoja4!$A$246:$B$250,2,FALSE),0)","v":0},{"$f":"IFERROR(VLOOKUP(P53,Hoja4!$A$246:$B$250,2,FALSE),0)","v":0},{"$f":"IFERROR(VLOOKUP(Q53,Hoja4!$A$246:$B$250,2,FALSE),0)","v":0},{"$f":"IFERROR(VLOOKUP(R53,Hoja4!$A$246:$B$250,2,FALSE),0)","v":0}]
[{"$f":"'F2. COMP. LAB Y COM COMPOR'!B56","v":0},null,{"$f":"VLOOKUP(A55,Hoja4!A$220:C$242,2,FALSE)","v":{"$error":"#N/A"}},null,null,{"$f":"VLOOKUP(A55,Hoja4!A$220:C$242,3,FALSE)","v":{"$error":"#N/A"}},null,null,null,null,null,null,null,null,null,null,null,null,{"$f":"+M56*M$58+N56*N$58+O56*O$58+P56*P$58+Q56*Q$58+R56*R$58","v":0}]
[null,null,null,null,null,null,null,null,null,null,null,null,{"$f":"IFERROR(VLOOKUP(M55,Hoja4!$A$246:$B$250,2,FALSE),0)","v":0},{"$f":"IFERROR(VLOOKUP(N55,Hoja4!$A$246:$B$250,2,FALSE),0)","v":0},{"$f":"IFERROR(VLOOKUP(O55,Hoja4!$A$246:$B$250,2,FALSE),0)","v":0},{"$f":"IFERROR(VLOOKUP(P55,Hoja4!$A$246:$B$250,2,FALSE),0)","v":0},{"$f":"IFERROR(VLOOKUP(Q55,Hoja4!$A$246:$B$250,2,FALSE),0)","v":0},{"$f":"IFERROR(VLOOKUP(R55,Hoja4!$A$246:$B$250,2,FALSE),0)","v":0}]
["PONDERACIÓN POR EVALUACIÓN EVENTUAL",null,null,null,null,null,null,null,null,null,null,null,{"$f":"+(M50+M52+M54+M56)/4","v":0},0,0,0,0,0,null,{"$f":"+M57*M58","v":0}]
["% Participación Días Laborados de cada Evaluación Eventual",null,null,null,null,null,null,null,null,null,null,null,{"$f":"+M44","v":0},0,0,0,0,0,null,{"$f":"+N57*N58","v":0}]
["CALIFICACIÓN TOTAL COMPETENCIAS COMPORTAMENTALES",null,null,null,null,null,null,null,null,null,null,null,{"$f":"+SUMPRODUCT(M57:R57,M58:R58)","v":0}]
[]
["VI. COMUNICACIÓN DE LA EVALUACIÓN",null,null,null,null,null,null,null,null,null,null,null,"F1. INF. GENERAL'!A1",null,null,null,"F3. EVIDENCIAS'!A1"]
["Nombre del Evaluado:",null,null,null,null,null,null,null,null,null,"FECHA"]
[]
["Firma"]
[]
[]
["Nombre del evaluador:"]
[]
["Firma",null,null,null,null,null,null,null,null,null,null,null,"F4. CALF. COM. COMPORT.'!A1",null,null,null,"F7. PLAN DE MEJORAMIENTO'!A1"]
[]
["Nombre del evaluador de LNR:"]
[]
["Firma"]

{"sheet":"F9. EV. EXTRAORDINARIA","index":10,"n_rows":198,"n_cols":19,"rows_kept":198,"cut":false,"hidden":false,"merged":[[77,2,79,7],[75,2,76,7],[77,8,79,18],[75,8,76,18],[72,8,74,18],[70,8,71,18],[80,0,80,18],[81,0,81,18],[67,0,67,18],[68,0,69,5],[68,6,69,12],[68,13,69,15],[68,16,69,18],[70,2,71,7],[72,2,74,7],[24,13,24,14],[26,0,26,18],[27,0,30,3],[27,4,30,8],[27,9,30,10],[27,11,28,18],[29,11,29,14],[29,15,29,18],[30,11,30,12],[30,13,30,14],[30,15,30,16],[24,15,24,16],[24,17,24,18],[25,0,25,5],[25,6,25,12],[25,13,25,14],[25,15,25,16],[25,17,25,18],[30,17,30,18],[23,0,23,1],[23,2,23,4],[23,5,23,7],[23,8,23,10],[23,11,23,14],[23,15,23,18],[22,0,22,1],[22,2,22,4],[22,5,22,7],[22,8,22,10],[22,11,22,14],[51,5,51,6],[51,7,51,8],[52,1,52,4],[52,5,52,6],[52,7,52,8],[49,7,49,8],[24,0,24,5],[24,6,24,12],[31,0,32,3],[31,4,32,8],[31,9,32,10],[31,11,32,12],[66,0,66,18],[82,0,82,18],[83,0,84,2],[83,3,84,3],[83,4,84,6],[83,7,84,10],[83,11,84,14],[83,15,84,18],[53,9,58,10],[61,0,62,1],[61,2,62,6],[61,16,62,18],[53,7,53,8],[53,1,53,4],[53,5,53,6],[53,11,55,18],[56,11,58,18],[54,0,55,4],[54,5,55,6],[54,7,55,8],[57,0,57,8],[58,0,58,8],[63,0,64,1],[63,16,65,18],[59,0,60,18],[61,7,62,8],[61,9,62,15],[56,0,56,4],[56,5,56,6],[56,7,56,8],[46,13,47,13],[46,14,47,16],[46,17,47,18],[48,0,48,8],[49,0,49,4],[49,5,49,6],[50,15,50,18],[50,11,50,14],[48,11,49,18],[50,1,50,4],[50,5,50,6],[50,7,50,8],[46,0,47,10],[46,11,47,12],[51,11,52,14],[51,15,52,18],[48,9,52,10],[51,1,51,4],[43,15,43,18],[44,0,45,10],[44,11,44,14],[44,15,44,18],[45,11,45,14],[45,15,45,18],[41,0,41,8],[41,9,41,10],[41,11,41,13],[41,15,41,17],[42,0,43,5],[42,6,42,10],[42,11,42,14],[42,15,42,18],[43,6,43,10],[43,11,43,14],[37,17,38,18],[39,0,40,3],[39,4,40,8],[39,9,40,10],[39,11,40,12],[39,13,40,14],[39,15,40,16],[39,17,40,18],[37,0,38,3],[37,4,38,8],[37,9,38,10],[37,11,38,12],[37,13,38,14],[37,15,38,16],[9,0,9,18],[11,0,11,1],[11,2,11,4],[11,5,11,7],[11,8,11,10],[11,11,11,14],[11,15,11,18],[13,0,13,7],[13,8,13,18],[12,0,12,7],[12,8,12,18],[10,0,10,1],[10,2,10,4],[10,5,10,7],[10,8,10,10],[10,11,10,14],[10,15,10,18],[19,13,19,14],[19,15,19,16],[19,17,19,18],[18,0,18,1],[18,2,18,4],[22,15,22,18],[18,5,18,7],[18,8,18,10],[18,11,18,14],[18,15,18,18],[19,0,19,5],[19,6,19,12],[20,0,20,5],[20,6,20,12],[20,13,20,14],[20,15,20,16],[20,17,20,18],[21,0,21,18],[17,0,17,1],[17,2,17,4],[17,5,17,7],[17,8,17,10],[17,11,17,14],[17,15,17,18],[16,0,16,18],[14,0,14,4],[14,5,14,6],[15,0,15,4],[15,5,15,6],[14,8,15,9],[14,10,15,18],[7,0,8,3],[7,7,8,8],[7,12,8,15],[1,0,6,3],[1,4,2,14],[1,15,6,18],[3,4,4,14],[5,4,6,6],[6,7,6,8],[6,9,6,10],[5,7,5,8],[5,9,5,10],[5,11,5,12],[5,13,5,14],[6,11,6,12],[6,13,6,14],[31,13,32,14],[31,15,32,16],[31,17,32,18],[33,17,34,18],[35,0,36,3],[35,4,36,8],[35,9,36,10],[35,11,36,12],[35,13,36,14],[35,15,36,16],[35,17,36,18],[33,0,34,3],[33,4,34,8],[33,9,34,10],[33,11,34,12],[33,13,34,14],[33,15,34,16]]}
[]
[null,null,null,null,"COMISIÓN NACIONAL DEL SERVICIO CIVIL"]
[]
[null,null,null,null,"FORMATO 9. EVALUACIÓN EXTRAORDINARIA"]
[]
[null,null,null,null,"PROCESO: EVALUACIÓN DEL DESEMPEÑO LABORAL",null,null,"Código:  ",null,"F-ED-010",null,"Página",null,"1 de 1"]
[null,null,null,null,null,null,null,"Fecha de emisión: ",null,"2016-02-10",null,"Versión: ",null,"1.0"]
["PERÍODO DE EVALUACIÓN",null,null,null,"DÍA","MES","AÑO","al",null,"DÍA","MES","AÑO","FECHA DE EVALUACIÓN",null,null,null,"DÍA","MES","AÑO"]
[]
["I. IDENTIFICACIÓN DEL EVALUADO"]
["Tipo de Documento",null,"Número de identificación",null,null,"Primer apellido",null,null,"Segundo apellido",null,null,"Primer nombre",null,null,null,"Otros nombres"]
[{"$f":"'F2. COMP. LAB Y COM COMPOR'!A13:B13","v":"CÉDULA DE CIUDADANÍA"},null,{"$f":"'F2. COMP. LAB Y COM COMPOR'!C13:E13","v":0},null,null,{"$f":"'F2. COMP. LAB Y COM COMPOR'!F13:H13","v":""},null,null,{"$f":"'F2. COMP. LAB Y COM COMPOR'!I13:K13","v":""},null,null,{"$f":"'F2. COMP. LAB Y COM COMPOR'!L13:O13","v":""},null,null,null,{"$f":"'F2. COMP. LAB Y COM COMPOR'!P13:S13","v":""}]
["Dependencia o área a la que pertenece el evaluado",null,null,null,null,null,null,null,"Denominación del empleo"]
[{"$f":"'F2. COMP. LAB Y COM COMPOR'!A15:H15","v":""},null,null,null,null,null,null,null,{"$f":"'F2. COMP. LAB Y COM COMPOR'!I15:S15","v":""}]
["Nivel jerárquico",null,null,null,null,"Código",null,"Grado",{"$f":"'F2. COMP. LAB Y COM COMPOR'!I16","v":"Propósito del empleo:"},null,{"$f":"'F2. COMP. LAB Y COM COMPOR'!J16","v":0}]
[{"$f":"'F2. COMP. LAB Y COM COMPOR'!A17:E17","v":""},null,null,null,null,{"$f":"'F2. COMP. LAB Y COM COMPOR'!F17:G17","v":""},null,{"$f":"'F2. COMP. LAB Y COM COMPOR'!H17","v":""}]
["II. IDENTIFICACIÓN EVALUADOR. (Jefe inmediato)"]
["Tipo de documento",null,"Número de identificación",null,null,"Primer apellido",null,null,"Segundo apellido",null,null,"Primer nombre",null,null,null,"Otros nombres"]
[{"$f":"'F2. COMP. LAB Y COM COMPOR'!A20:B20","v":"CEDULA DE CIUDADANIA"},null,{"$f":"'F2. COMP. LAB Y COM COMPOR'!C20:E20","v":0},null,null,{"$f":"'F2. COMP. LAB Y COM COMPOR'!F20:H20","v":""},null,null,{"$f":"'F2. COMP. LAB Y COM COMPOR'!I20:K20","v":""},null,null,{"$f":"'F2. COMP. LAB Y COM COMPOR'!L20:O20","v":""},null,null,null,{"$f":"'F2. COMP. LAB Y COM COMPOR'!P20:S20","v":""}]
[" Área o Dependencia a la que pertenece el evaluador",null,null,null,null,null,"Denominación del empleo",null,null,null,null,null,null,"Código",null,"Grado",null,"Nivel jerárquico"]
[{"$f":"'F2. COMP. LAB Y COM COMPOR'!A22:F22","v":""},null,null,null,null,null,{"$f":"'F2. COMP. LAB Y COM COMPOR'!G22:M22","v":""},null,null,null,null,null,null,{"$f":"'F2. COMP. LAB Y COM COMPOR'!N22:O22","v":""},null,{"$f":"'F2. COMP. LAB Y COM COMPOR'!P22:Q22","v":""},null,{"$f":"'F2. COMP. LAB Y COM COMPOR'!R22:S22","v":""}]
["III. IDENTIFICACIÓN EVALUADOR (Servidor público de Libre Nombramiento y Remoción en caso de constituir Comisión Evaluadora)"]
["Tipo de documento",null,"Número de identificación",null,null,"Primer apellido",null,null,"Segundo apellido",null,null,"Primer nombre",null,null,null,"Otros nombres"]
[{"$f":"'F2. COMP. LAB Y COM COMPOR'!A25:B25","v":"CEDULA DE CIUDADANIA"},null,{"$f":"'F2. COMP. LAB Y COM COMPOR'!C25:E25","v":0},null,null,{"$f":"'F2. COMP. LAB Y COM COMPOR'!F25:H25","v":""},null,null,{"$f":"'F2. COMP. LAB Y COM COMPOR'!I25:K25","v":""},null,null,{"$f":"'F2. COMP. LAB Y COM COMPOR'!L25:O25","v":""},null,null,null,{"$f":"'F2. COMP. LAB Y COM COMPOR'!P25:S25","v":""}]
["Dependencia o área a la que pertenece el evaluador",null,null,null,null,null,"Denominación del empleo",null,null,null,null,null,null,"Código",null,"Grado",null,"Nivel jerárquico"]
[{"$f":"'F2. COMP. LAB Y COM COMPOR'!A27:F27","v":""},null,null,null,null,null,{"$f":"'F2. COMP. LAB Y COM COMPOR'!G27:M27","v":""},null,null,null,null,null,null,{"$f":"'F2. COMP. LAB Y COM COMPOR'!N27:O27","v":""},null,{"$f":"'F2. COMP. LAB Y COM COMPOR'!P27:Q27","v":""},null,{"$f":"'F2. COMP. LAB Y COM COMPOR'!R27:S27","v":""}]
["IV. COMPROMISOS LABORALES"]
["Metas de la Dependencia a las cuales contribuye el empleo",null,null,null,"Compromisos Laborales.",null,null,null,null,"Peso porcentual del compromiso",null,"Porcentaje de Cumplimiento. "]
[]
[null,null,null,null,null,null,null,null,null,null,null," EVALUACIÓN REALIZADA PREVIA A LA EXTRAORDINARIA (Si hubo)",null,null,null,"EVALUACIÓN ULTIMO PERÍODO"]
[null,null,null,null,null,null,null,null,null,null,null,"CALIFICACIÓN DEL COMPROMISO",null,"CALIFICACIÓN DEL COMPROMISO (Con peso porcentual)",null,"CALIFICACIÓN DEL COMPROMISO",null,"CALIFICACIÓN DEL COMPROMISO (Con peso porcentual)"]
[{"$f":"'F2. COMP. LAB Y COM COMPOR'!A36","v":0},null,null,null,{"$f":"'F2. COMP. LAB Y COM COMPOR'!H36","v":0},null,null,null,null,{"$f":"'F2. COMP. LAB Y COM COMPOR'!Q36","v":0},null,null,null,{"$f":"$J32*L32","v":0},null,null,null,{"$f":"$J32*P32","v":0}]
[]
[{"$f":"'F2. COMP. LAB Y COM COMPOR'!A38","v":0},null,null,null,{"$f":"'F2. COMP. LAB Y COM COMPOR'!H38","v":0},null,null,null,null,{"$f":"'F2. COMP. LAB Y COM COMPOR'!Q38","v":0},null,null,null,{"$f":"J34*L34","v":0},null,null,null,{"$f":"$J34*P34","v":0}]
[]
[{"$f":"'F2. COMP. LAB Y COM COMPOR'!A40","v":0},null,null,null,{"$f":"'F2. COMP. LAB Y COM COMPOR'!H40","v":0},null,null,null,null,{"$f":"'F2. COMP. LAB Y COM COMPOR'!Q40","v":0},null,null,null,{"$f":"J36*L36","v":0},null,null,null,{"$f":"$J36*P36","v":0}]
[]
[{"$f":"'F2. COMP. LAB Y COM COMPOR'!A42","v":0},null,null,null,{"$f":"'F2. COMP. LAB Y COM COMPOR'!H42","v":0},null,null,null,null,{"$f":"'F2. COMP. LAB Y COM COMPOR'!Q42","v":0},null,null,null,{"$f":"J38*L38","v":0},null,null,null,{"$f":"$J38*P38","v":0}]
[]
[{"$f":"'F2. COMP. LAB Y COM COMPOR'!A44","v":0},null,null,null,{"$f":"'F2. COMP. LAB Y COM COMPOR'!H44","v":0},null,null,null,null,{"$f":"'F2. COMP. LAB Y COM COMPOR'!Q44","v":0},null,null,null,{"$f":"J40*L40","v":0},null,null,null,{"$f":"$J40*P40","v":0}]
[]
[" PESO TOTAL PONDERADO DE LOS COMPROMISOS LABORALES",null,null,null,null,null,null,null,null,{"$f":"SUM(J32:K41)","v":0},null,"Resultado total ",null,null,{"$f":"SUMIF(N32:O41,\"<100\",N32:O41)","v":0},"Resultado total ",null,null,{"$f":"SUMIF(R32:S41,\"<100\",R32:S41)","v":0}]
["Días Efectivamente Laborados",null,null,null,null,null,"Total Días Laborados Efectivamente",null,null,null,null,0]
[null,null,null,null,null,null,"% Participación Días Laborados para la Evaluación Extraordinaria",null,null,null,null,{"$f":"IFERROR(+L43/($L$43+$P$43),0)","v":0},null,null,null,{"$f":"IFERROR(+P43/($L$43+$P$43),0)","v":0}]
["Calificaciones parciales semestrales compromisos laborales ",null,null,null,null,null,null,null,null,null,null,"1° Calificación",null,null,null,"2° Calificación"]
[null,null,null,null,null,null,null,null,null,null,null,{"$f":"O42*40","v":0},null,null,null,{"$f":"S42*40","v":0}]
["CALIFICACIÓN TOTAL COMPROMISOS LABORALES",null,null,null,null,null,null,null,null,null,null,"Sobre el 100%",null,{"$f":"(O42*L44+S42*P44)","v":0},"Sobre el peso porcentual del 85%",null,null,{"$f":"+N47*85%","v":0}]
[]
["V. COMPETENCIAS COMPORTAMENTALES",null,null,null,null,null,null,null,null,"F4. CALF. COM. COMPORT.'!A1",null,"VI. RESULTADOS CONSOLIDADOS EVALUCIÒN EXTRAORDINARIA"]
["COMPETENCIAS COMPORTAMENTALES",null,null,null,null,"Eva. Previa a la EXTR.\n(Si hubo)",null,"Eva. Último período."]
["1.  ",{"$f":"'F2. COMP. LAB Y COM COMPOR'!B50","v":0},null,null,null,null,null,null,null,null,null,"CALIFICACIÓN",null,null,null,"NIVEL DE CALIFICACIÓN"]
["2. ",{"$f":"'F2. COMP. LAB Y COM COMPOR'!B52","v":0},null,null,null,null,null,null,null,null,null,{"$f":"SUM(R47,A59)/100","v":0},null,null,null,{"$f":"IFERROR(VLOOKUP(L52,Hoja4!T$2:U$101,2),0)","v":0}]
["3. ",{"$f":"'F2. COMP. LAB Y COM COMPOR'!B54","v":0}]
["4. ",{"$f":"'F2. COMP. LAB Y COM COMPOR'!B56","v":0},null,null,null,null,null,null,null,"F7. PLAN DE MEJORAMIENTO'!A1",null,"F2. COMP. LAB Y COM COMPOR'!A1"]
["CALIFICACIÓN",null,null,null,null,{"$f":"SUM(F51:G54)/4","v":0},null,{"$f":"SUM(H51:I54)/4","v":0}]
[]
["% Participación Días Laborados de cada Eva. Eventual",null,null,null,null,{"$f":"+L44","v":0},null,{"$f":"+P44","v":0},null,null,null,"F3. EVIDENCIAS'!A1"]
["CALIFICACIÓN DE LAS COMPETENCIAS COMPORTAMENTALES"]
[{"$f":"+F55*F57+H55*H57","v":0}]
["VII. NOTIFICACIÓN"]
[]
["Nombre del Evaluado:",null,null,null,null,null,null,"Nombre del evaluador:",null,null,null,null,null,null,null,null,"RECURSO"]
[]
["Firma"]
[null,null,null,null,null,null,null,"Firma"]
[]
["VIII. DECISIÓN DE RECURSOS"]
["RECURSO DE REPOSICIÓN"]
["DECISIÓN",null,null,null,null,null,null,null,null,null,null,null,null,"FECHA"]
[]
[null,null,"Nombre del Evaluado:"]
[]
[null,null,"Firma"]
[]
[]
[null,null,"Nombre del Notificador:"]
[]
[null,null,"Firma"]
[]
[]
["MOTIVACIÓN (Anexar Acto Administrativo):"]
[]
["IX. CALIFICACIÓN DEFINITIVA"]
["CALIFICACIÓN DEFINITIVA EN FIRME",null,null,null,"FIRMA Y NÚMERO DE CÉDULA DEL NOTIFICADO",null,null,null,null,null,null,"FIRMA Y NÚMERO DE CÉDULA DEL NOTIFICADOR"]
[]
[]
[]
[]
[]
[]
[]
[]
[]
[]
[]
[]
[]
[]
[]
[]
[]
[]
[]
[]
[]
[]
[]
[]
[]
[]
[]
[]
[]
[]
[]
[]
[null,null,null,null,null,null,null,null,null,null,null,"Cedula de ciudadanía"]
[null,null,null,null,null,null,null,null,null,null,null,"Cedula de extranjería"]
[]
[]
[]
[]
[]
[]
[]
[]
[]
[]
[]
[]
[]
[]
[]
[null,null,null,"Asesor"]
[null,null,null,"profesional"]
[null,null,null,"Técnico"]
[null,null,null,"Asistencial"]
[]
[]
[]
[]
[]
[]
[]
[]
[]
[]
[]
[]
[]
[]
[]
[]
[]
[]
[]
[]
[null,null,null,null,null,null,null,null,null,60]
[null,null,null,null,null,null,null,null,null,61]
[null,null,null,null,null,null,null,null,null,62]
[null,null,null,null,null,null,null,null,null,63]
[null,null,null,null,null,null,null,null,null,64]
[null,null,null,null,null,null,null,null,null,65]
[null,null,null,null,null,null,null,null,null,66]
[null,null,null,null,null,null,null,null,null,67]
[null,null,null,null,null,null,null,null,null,68]
[null,null,null,null,null,null,null,null,null,69]
[null,null,null,null,null,null,null,null,null,70]
[null,null,null,null,null,null,null,null,null,71]
[null,null,null,null,null,null,null,null,null,72]
[null,null,null,null,null,null,null,null,null,73]
[null,null,null,null,null,null,null,null,null,74]
[null,null,null,null,null,null,null,null,null,75]
[null,null,null,null,null,null,null,null,null,76]
[null,null,null,null,null,null,null,null,null,77]
[null,null,null,null,null,null,null,null,null,78]
[null,null,null,null,null,null,null,null,null,79]
[null,null,null,null,null,null,null,null,null,80]
[null,null,null,null,null,null,null,null,null,81]
[null,null,null,null,null,null,null,null,null,82]
[null,null,null,null,null,null,null,null,null,83]
[null,null,null,null,null,null,null,null,null,84]
[null,null,null,null,null,null,null,null,null,85]
[null,null,null,null,null,null,null,null,null,86]
[null,null,null,null,null,null,null,null,null,87]
[null,null,null,null,null,null,null,null,null,88]
[null,null,null,null,null,null,null,null,null,89]
[null,null,null,null,null,null,null,null,null,90]
[null,null,null,null,null,null,null,null,null,91]
[null,null,null,null,null,null,null,null,null,92]
[null,null,null,null,null,null,null,null,null,93]
[null,null,null,null,null,null,null,null,null,94]
[null,null,null,null,null,null,null,null,null,95]
[null,null,null,null,null,null,null,null,null,96]
[null,null,null,null,null,null,null,null,null,97]
[null,null,null,null,null,null,null,null,null,98]
[null,null,null,null,null,null,null,null,null,99]
[null,null,null,null,null,null,null,null,null,100]

{"sheet":"F10. EVA. INFERIOR AL SEMESTRE","index":11,"n_rows":198,"n_cols":19,"rows_kept":198,"cut":false,"hidden":false,"merged":[[72,8,74,18],[70,8,71,18],[61,7,62,8],[61,9,62,15],[23,0,23,1],[23,2,23,4],[23,5,23,7],[23,8,23,10],[23,11,23,14],[23,15,23,18],[24,0,24,5],[24,6,24,12],[25,0,25,5],[25,6,25,12],[25,13,25,14],[25,15,25,16],[25,17,25,18],[24,13,24,14],[24,15,24,16],[24,17,24,18],[61,16,62,18],[53,7,53,8],[53,11,53,14],[53,15,53,18],[54,11,55,14],[54,15,55,18],[82,0,82,18],[83,0,84,2],[83,3,84,3],[83,4,84,6],[83,7,84,10],[83,11,84,14],[83,15,84,18],[81,0,81,18],[80,0,80,18],[68,0,69,5],[68,6,69,11],[68,15,69,18],[68,12,69,14],[77,4,79,7],[75,4,76,7],[72,4,74,7],[70,4,71,7],[77,8,79,18],[75,8,76,18],[66,0,66,18],[67,0,67,18],[63,0,64,1],[63,16,65,18],[43,11,43,14],[43,15,43,18],[56,0,56,4],[56,5,56,6],[56,7,56,8],[59,0,60,18],[42,0,43,5],[42,6,42,10],[43,6,43,10],[42,11,42,14],[61,0,62,1],[61,2,62,6],[56,11,58,13],[56,16,58,18],[56,14,58,15],[54,0,55,4],[54,5,55,6],[54,7,55,8],[57,0,57,8],[58,0,58,8],[51,9,54,10],[55,9,58,10],[51,1,51,4],[51,5,51,6],[51,7,51,8],[51,11,52,18],[52,1,52,4],[52,5,52,6],[52,7,52,8],[53,1,53,4],[53,5,53,6],[49,7,49,8],[49,11,50,14],[49,15,50,18],[50,1,50,4],[50,5,50,6],[50,7,50,8],[46,0,47,10],[46,14,47,14],[48,0,48,8],[48,9,50,10],[48,11,48,18],[49,0,49,4],[49,5,49,6],[46,15,47,17],[46,11,47,13],[46,18,47,18],[41,0,41,8],[41,9,41,10],[41,11,41,13],[41,15,41,17],[44,0,45,10],[45,11,45,14],[45,15,45,18],[42,15,42,18],[44,11,44,18],[37,17,38,18],[39,0,40,3],[39,4,40,8],[39,9,40,10],[39,11,40,12],[39,13,40,14],[39,15,40,16],[39,17,40,18],[37,0,38,3],[37,4,38,8],[37,9,38,10],[37,11,38,12],[37,13,38,14],[37,15,38,16],[33,17,34,18],[35,0,36,3],[35,4,36,8],[35,9,36,10],[35,11,36,12],[35,13,36,14],[35,15,36,16],[35,17,36,18],[33,0,34,3],[33,4,34,8],[33,9,34,10],[33,11,34,12],[33,13,34,14],[33,15,34,16],[30,17,30,18],[31,0,32,3],[31,4,32,8],[31,9,32,10],[31,11,32,12],[31,13,32,14],[31,15,32,16],[31,17,32,18],[26,0,26,18],[27,0,30,3],[27,4,30,8],[27,9,30,10],[27,11,28,18],[29,11,29,14],[29,15,29,18],[30,11,30,12],[30,13,30,14],[30,15,30,16],[9,0,9,18],[11,0,11,1],[11,2,11,4],[11,5,11,7],[11,8,11,10],[11,11,11,14],[11,15,11,18],[13,0,13,7],[13,8,13,18],[10,0,10,1],[10,2,10,4],[10,5,10,7],[10,8,10,10],[10,11,10,14],[10,15,10,18],[19,13,19,14],[19,15,19,16],[19,17,19,18],[18,0,18,1],[18,2,18,4],[18,5,18,7],[18,8,18,10],[18,11,18,14],[18,15,18,18],[19,0,19,5],[19,6,19,12],[22,0,22,1],[22,2,22,4],[22,5,22,7],[22,8,22,10],[22,11,22,14],[22,15,22,18],[20,0,20,5],[20,6,20,12],[20,13,20,14],[20,15,20,16],[20,17,20,18],[21,0,21,18],[17,0,17,1],[17,2,17,4],[17,5,17,7],[17,8,17,10],[17,11,17,14],[17,15,17,18],[14,0,14,4],[14,5,14,6],[12,0,12,7],[12,8,12,18],[15,0,15,4],[15,5,15,6],[16,0,16,18],[14,8,15,10],[14,11,15,18],[7,0,8,3],[7,7,8,8],[7,12,8,15],[1,0,6,3],[1,4,2,14],[1,15,6,18],[3,4,4,14],[5,4,6,6],[6,7,6,8],[6,9,6,10],[5,7,5,8],[5,9,5,10],[5,11,5,12],[5,13,5,14],[6,11,6,12],[6,13,6,14]]}
[]
[null,null,null,null,"COMISIÓN NACIONAL DEL SERVICIO CIVIL"]
[]
[null,null,null,null,"FORMATO 10 EVALUACIÓN INFERIOR A UN (1) AÑO."]
[]
[null,null,null,null,"PROCESO: EVALUACIÓN DEL DESEMPEÑO LABORAL",null,null,"Código:  ",null,"F-ED-011",null,"Página",null,"1 de 1"]
[null,null,null,null,null,null,null,"Fecha de emisión: ",null,"2016-02-10",null,"Versión: ",null,"1.0"]
["PERÍODO DE EVALUACIÓN",null,null,null,"DÍA","MES","AÑO","al",null,"DÍA","MES","AÑO","FECHA DE EVALUACIÓN",null,null,null,"DÍA","MES","AÑO"]
[]
["I. IDENTIFICACIÓN DEL EVALUADO"]
["Tipo de Documento",null,"Número de identificación",null,null,"Primer apellido",null,null,"Segundo apellido",null,null,"Primer nombre",null,null,null,"Otros nombres"]
[{"$f":"'F2. COMP. LAB Y COM COMPOR'!A13:B13","v":"CÉDULA DE CIUDADANÍA"},null,{"$f":"'F2. COMP. LAB Y COM COMPOR'!C13:E13","v":0},null,null,{"$f":"'F2. COMP. LAB Y COM COMPOR'!F13:H13","v":""},null,null,{"$f":"'F2. COMP. LAB Y COM COMPOR'!I13:K13","v":""},null,null,{"$f":"'F2. COMP. LAB Y COM COMPOR'!L13:O13","v":""},null,null,null,{"$f":"'F2. COMP. LAB Y COM COMPOR'!P13:S13","v":""}]
["Dependencia o área a la que pertenece el evaluado",null,null,null,null,null,null,null,"Denominación del empleo"]
[{"$f":"'F2. COMP. LAB Y COM COMPOR'!A15:H15","v":""},null,null,null,null,null,null,null,{"$f":"'F2. COMP. LAB Y COM COMPOR'!I15:S15","v":""}]
["Nivel jerárquico",null,null,null,null,"Código",null,"Grado",{"$f":"'F2. COMP. LAB Y COM COMPOR'!I16","v":"Propósito del empleo:"},null,null,{"$f":"'F2. COMP. LAB Y COM COMPOR'!J16","v":0}]
[{"$f":"'F2. COMP. LAB Y COM COMPOR'!A17:E17","v":""},null,null,null,null,{"$f":"'F2. COMP. LAB Y COM COMPOR'!F17:G17","v":""},null,{"$f":"'F2. COMP. LAB Y COM COMPOR'!H17","v":""}]
["II. IDENTIFICACIÓN EVALUADOR. (Jefe inmediato)"]
["Tipo de documento",null,"Número de identificación",null,null,"Primer apellido",null,null,"Segundo apellido",null,null,"Primer nombre",null,null,null,"Otros nombres"]
[{"$f":"'F2. COMP. LAB Y COM COMPOR'!A20:B20","v":"CEDULA DE CIUDADANIA"},null,{"$f":"'F2. COMP. LAB Y COM COMPOR'!C20:E20","v":0},null,null,{"$f":"'F2. COMP. LAB Y COM COMPOR'!F20:H20","v":""},null,null,{"$f":"'F2. COMP. LAB Y COM COMPOR'!I20:K20","v":""},null,null,{"$f":"'F2. COMP. LAB Y COM COMPOR'!L20:O20","v":""},null,null,null,{"$f":"'F2. COMP. LAB Y COM COMPOR'!P20:S20","v":""}]
[" Área o Dependencia a la que pertenece el evaluador",null,null,null,null,null,"Denominación del empleo",null,null,null,null,null,null,"Código",null,"Grado",null,"Nivel jerárquico"]
[{"$f":"'F2. COMP. LAB Y COM COMPOR'!A22:F22","v":""},null,null,null,null,null,{"$f":"'F2. COMP. LAB Y COM COMPOR'!G22:M22","v":""},null,null,null,null,null,null,{"$f":"'F2. COMP. LAB Y COM COMPOR'!N22:O22","v":""},null,{"$f":"'F2. COMP. LAB Y COM COMPOR'!P22:Q22","v":""},null,{"$f":"'F2. COMP. LAB Y COM COMPOR'!R22:S22","v":""}]
["III. IDENTIFICACIÓN EVALUADOR (Servidor público de Libre Nombramiento y Remoción en caso de constituir Comisión Evaluadora)"]
["Tipo de documento",null,"Número de identificación",null,null,"Primer apellido",null,null,"Segundo apellido",null,null,"Primer nombre",null,null,null,"Otros nombres"]
[{"$f":"'F2. COMP. LAB Y COM COMPOR'!A25:B25","v":"CEDULA DE CIUDADANIA"},null,{"$f":"'F2. COMP. LAB Y COM COMPOR'!C25:E25","v":0},null,null,{"$f":"'F2. COMP. LAB Y COM COMPOR'!F25:H25","v":""},null,null,{"$f":"'F2. COMP. LAB Y COM COMPOR'!I25:K25","v":""},null,null,{"$f":"'F2. COMP. LAB Y COM COMPOR'!L25:O25","v":""},null,null,null,{"$f":"'F2. COMP. LAB Y COM COMPOR'!P25:S25","v":""}]
["Dependencia o área a la que pertenece el evaluador",null,null,null,null,null,"Denominación del empleo",null,null,null,null,null,null,"Código",null,"Grado",null,"Nivel jerárquico"]
[{"$f":"'F2. COMP. LAB Y COM COMPOR'!A27:F27","v":""},null,null,null,null,null,{"$f":"'F2. COMP. LAB Y COM COMPOR'!G27:M27","v":""},null,null,null,null,null,null,{"$f":"'F2. COMP. LAB Y COM COMPOR'!N27:O27","v":""},null,{"$f":"'F2. COMP. LAB Y COM COMPOR'!P27:Q27","v":""},null,{"$f":"'F2. COMP. LAB Y COM COMPOR'!R27:S27","v":""}]
["IV. COMPROMISOS LABORALES"]
["Metas de la Dependencia las cuales contribuye el empleo",null,null,null,"Compromisos Laborales.",null,null,null,null,"Peso porcentual del compromiso",null,"Porcentaje de Cumplimiento. "]
[]
[null,null,null,null,null,null,null,null,null,null,null," EVALUACIÓN REALIZADA PREVIA A LA PRESENTE",null,null,null,"EVALUACIÓN ULTIMO PERÍODO"]
[null,null,null,null,null,null,null,null,null,null,null,"CALIFICACIÓN DEL COMPROMISO",null,"CALIFICACIÓN DEL COMPROMISO (Con peso porcentual)",null,"CALIFICACIÓN DEL COMPROMISO",null,"CALIFICACIÓN DEL COMPROMISO (Con peso porcentual)"]
[{"$f":"'F2. COMP. LAB Y COM COMPOR'!A36","v":0},null,null,null,{"$f":"'F2. COMP. LAB Y COM COMPOR'!H36","v":0},null,null,null,null,{"$f":"'F2. COMP. LAB Y COM COMPOR'!Q36","v":0},null,null,null,{"$f":"$J32*L32","v":0},null,null,null,{"$f":"$J32*P32","v":0}]
[]
[{"$f":"'F2. COMP. LAB Y COM COMPOR'!A38","v":0},null,null,null,{"$f":"'F2. COMP. LAB Y COM COMPOR'!H38","v":0},null,null,null,null,{"$f":"'F2. COMP. LAB Y COM COMPOR'!Q38","v":0},null,null,null,{"$f":"J34*L34","v":0},null,null,null,{"$f":"$J34*P34","v":0}]
[]
[{"$f":"'F2. COMP. LAB Y COM COMPOR'!A40","v":0},null,null,null,{"$f":"'F2. COMP. LAB Y COM COMPOR'!H40","v":0},null,null,null,null,{"$f":"'F2. COMP. LAB Y COM COMPOR'!Q40","v":0},null,null,null,{"$f":"J36*L36","v":0},null,null,null,{"$f":"$J36*P36","v":0}]
[]
[{"$f":"'F2. COMP. LAB Y COM COMPOR'!A42","v":0},null,null,null,{"$f":"'F2. COMP. LAB Y COM COMPOR'!H42","v":0},null,null,null,null,{"$f":"'F2. COMP. LAB Y COM COMPOR'!Q42","v":0},null,null,null,{"$f":"J38*L38","v":0},null,null,null,{"$f":"$J38*P38","v":0}]
[]
[{"$f":"'F2. COMP. LAB Y COM COMPOR'!A44","v":0},null,null,null,{"$f":"'F2. COMP. LAB Y COM COMPOR'!H44","v":0},null,null,null,null,{"$f":"'F2. COMP. LAB Y COM COMPOR'!Q44","v":0},null,null,null,{"$f":"J40*L40","v":0},null,null,null,{"$f":"$J40*P40","v":0}]
[]
[" PESO TOTAL PONDERADO DE LOS COMPROMISOS LABORALES",null,null,null,null,null,null,null,null,{"$f":"SUM(J32:K41)","v":0},null,"Resultado total ",null,null,{"$f":"SUMIF(N32:O41,\"<100\",N32:O41)/100","v":0},"Resultado total ",null,null,{"$f":"SUMIF(R32:S41,\"<100\",R32:S41)/100","v":0}]
["Días Efectivamente Laborados",null,null,null,null,null,"Total Días Laborados de cada Evaluación Eventual"]
[null,null,null,null,null,null,"% Participación Días Laborados de cada Evaluación Eventual",null,null,null,null,{"$f":"IFERROR(+L43/($L$43+$P$43),0)","v":0},null,null,null,{"$f":"IFERROR(+P43/($L$43+$P$43),0)","v":0}]
["Calificaciones parciales semestrales compromisos laborales ",null,null,null,null,null,null,null,null,null,null,"Calificación total"]
[null,null,null,null,null,null,null,null,null,null,null,{"$f":"O42*40","v":0},null,null,null,{"$f":"S42*40","v":0}]
["CALIFICACIÓN TOTAL COMPROMISOS LABORALES",null,null,null,null,null,null,null,null,null,null,"Sobre el 100%",null,null,{"$f":"(O42*L44+S42*P44)","v":0},"Sobre el peso porcentual del 80%",null,null,{"$f":"+O47*80","v":0}]
[]
["V. COMPETENCIAS COMPORTAMENTALES",null,null,null,null,null,null,null,null,"F5. EVA. ÁREAS O DEPENDENCIAS.'!A1",null,"VI. EVALUACIÓN DE GESTIÓN POR ÁREAS O DEPENDENCIAS"]
["COMPETENCIAS COMPORTAMENTALES",null,null,null,null,"Última Ev. Realizada",null,"Evaluac. Ordinaria",null,null,null,"CALIFICACIÓN DE LA EVALUACIÓN DE GESTIÓN POR ÁREAS O  DEPENDENCIAS."]
["1.  ",{"$f":"'F2. COMP. LAB Y COM COMPOR'!B50","v":0}]
["2. ",{"$f":"'F2. COMP. LAB Y COM COMPOR'!B52","v":0},null,null,null,null,null,null,null,"F4. CALF. COM. COMPORT.'!A1",null,"VII. RESULTADOS CONSOLIDADOS COMPONENTES DE LA EVALUACIÓN DE DESEMPEÑO LABORAL PARA LA EVALUACIÓN INFERIOR A UN AÑO."]
["3. ",{"$f":"'F2. COMP. LAB Y COM COMPOR'!B54","v":0}]
["4. ",{"$f":"'F2. COMP. LAB Y COM COMPOR'!B56","v":0},null,null,null,null,null,null,null,null,null,"CALIFICACIÓN",null,null,null,"NIVEL DE CALIFICACIÓN"]
["CALIFICACIÓN",null,null,null,null,{"$f":"SUM(F51:G54)/4","v":0},null,{"$f":"SUM(H51:I54)/4","v":0},null,null,null,{"$f":"+S47+P50+A59","v":0},null,null,null,{"$f":"IFERROR(VLOOKUP(L55,Hoja4!AA$3:AB$991,2),0)","v":0}]
[null,null,null,null,null,null,null,null,null,"F1. INF. GENERAL'!A1"]
["% Participación Días Laborados de cada Ev. Eventual",null,null,null,null,{"$f":"+L44","v":0},null,{"$f":"+P44","v":0},null,null,null,"F7. PLAN DE MEJORAMIENTO'!A1",null,null,"F2. COMP. LAB Y COM COMPOR'!A1",null,"F3. EVIDENCIAS'!A1"]
["CALIFICACIÓN DE LAS COMPETENCIAS COMPORTAMENTALES"]
[{"$f":"+F55*F57+H55*H57","v":0}]
["VIII. NOTIFICACIÓN"]
[]
["Nombre del Evaluado:",null,null,null,null,null,null,"Nombre del evaluador:",null,null,null,null,null,null,null,null,"RECURSO"]
[]
["Firma"]
[null,null,null,null,null,null,null,"Firma"]
[]
["IX. DECISION DE RECURSOS"]
["RECURSO DE REPOSICIÓN"]
["DECISIÓN",null,null,null,null,null,null,null,null,null,null,null,"FECHA"]
[]
[null,null,null,null,"Nombre del Evaluado:"]
[]
[null,null,null,null,"Firma"]
[]
[]
[null,null,null,null,"Nombre del Notificador:"]
[]
[null,null,null,null,"Firma"]
[]
[]
["MOTIVACIÓN (Anexar Acto Administrativo):"]
[]
["X. CALIFICACIÓN DEFINITIVA"]
["CALIFICACIÓN DEFINITIVA EN FIRME",null,null,null,"FIRMA Y NÚMERO DE CÉDULA DEL NOTIFICADO",null,null,null,null,null,null,"FIRMA Y NÚMERO DE CÉDULA DEL NOTIFICADOR"]
[]
[null,null,null,null,null,null,"}"]
[]
[]
[]
[]
[]
[]
[]
[]
[]
[]
[]
[]
[]
[]
[]
[]
[]
[]
[]
[]
[]
[]
[]
[]
[]
[]
[]
[]
[]
[]
[null,null,null,null,null,null,null,null,null,null,null,"Cedula de ciudadanía"]
[null,null,null,null,null,null,null,null,null,null,null,"Cedula de extranjería"]
[]
[]
[]
[]
[]
[]
[]
[]
[]
[]
[]
[]
[]
[]
[]
[null,null,null,"Asesor"]
[null,null,null,"profesional"]
[null,null,null,"Técnico"]
[null,null,null,"Asistencial"]
[]
[]
[]
[]
[]
[]
[]
[]
[]
[]
[]
[]
[]
[]
[]
[]
[]
[]
[]
[]
[null,null,null,null,null,null,null,null,null,60]
[null,null,null,null,null,null,null,null,null,61]
[null,null,null,null,null,null,null,null,null,62]
[null,null,null,null,null,null,null,null,null,63]
[null,null,null,null,null,null,null,null,null,64]
[null,null,null,null,null,null,null,null,null,65]
[null,null,null,null,null,null,null,null,null,66]
[null,null,null,null,null,null,null,null,null,67]
[null,null,null,null,null,null,null,null,null,68]
[null,null,null,null,null,null,null,null,null,69]
[null,null,null,null,null,null,null,null,null,70]
[null,null,null,null,null,null,null,null,null,71]
[null,null,null,null,null,null,null,null,null,72]
[null,null,null,null,null,null,null,null,null,73]
[null,null,null,null,null,null,null,null,null,74]
[null,null,null,null,null,null,null,null,null,75]
[null,null,null,null,null,null,null,null,null,76]
[null,null,null,null,null,null,null,null,null,77]
[null,null,null,null,null,null,null,null,null,78]
[null,null,null,null,null,null,null,null,null,79]
[null,null,null,null,null,null,null,null,null,80]
[null,null,null,null,null,null,null,null,null,81]
[null,null,null,null,null,null,null,null,null,82]
[null,null,null,null,null,null,null,null,null,83]
[null,null,null,null,null,null,null,null,null,84]
[null,null,null,null,null,null,null,null,null,85]
[null,null,null,null,null,null,null,null,null,86]
[null,null,null,null,null,null,null,null,null,87]
[null,null,null,null,null,null,null,null,null,88]
[null,null,null,null,null,null,null,null,null,89]
[null,null,null,null,null,null,null,null,null,90]
[null,null,null,null,null,null,null,null,null,91]
[null,null,null,null,null,null,null,null,null,92]
[null,null,null,null,null,null,null,null,null,93]
[null,null,null,null,null,null,null,null,null,94]
[null,null,null,null,null,null,null,null,null,95]
[null,null,null,null,null,null,null,null,null,96]
[null,null,null,null,null,null,null,null,null,97]
[null,null,null,null,null,null,null,null,null,98]
[null,null,null,null,null,null,null,null,null,99]
[null,null,null,null,null,null,null,null,null,100]

{"sheet":"F11. EVA P. PRUEBA","index":12,"n_rows":92,"n_cols":19,"rows_kept":92,"cut":false,"hidden":false,"merged":[[73,0,73,18],[74,0,75,5],[74,6,75,12],[74,13,75,15],[74,16,75,18],[87,0,87,18],[86,0,86,18],[83,4,85,7],[81,4,82,7],[78,4,80,7],[76,4,77,7],[83,8,85,18],[81,8,82,18],[78,8,80,18],[76,8,77,18],[59,17,59,18],[60,0,62,5],[60,6,62,11],[60,12,62,18],[63,0,63,3],[63,4,63,5],[63,6,64,11],[63,12,64,18],[64,0,64,3],[64,4,64,5],[13,0,13,7],[13,8,13,18],[6,7,6,8],[6,9,6,10],[6,11,6,12],[6,13,6,14],[10,11,10,14],[9,0,9,18],[11,0,11,1],[11,2,11,4],[11,5,11,7],[11,8,11,10],[11,11,11,14],[11,15,11,18],[12,8,12,18],[22,8,22,10],[22,11,22,14],[18,11,18,14],[22,2,22,4],[17,15,17,18],[14,8,15,9],[14,10,15,18],[15,0,15,4],[15,5,15,6],[16,0,16,18],[17,2,17,4],[17,5,17,7],[17,8,17,10],[17,11,17,14],[17,0,17,1],[18,0,18,1],[18,2,18,4],[18,5,18,7],[18,8,18,10],[18,15,18,18],[29,0,29,18],[30,10,33,11],[30,12,31,18],[0,0,6,3],[0,4,2,14],[0,15,6,18],[10,2,10,4],[10,5,10,7],[10,8,10,10],[7,0,8,3],[7,7,8,8],[7,12,8,15],[3,4,4,14],[5,4,6,6],[5,7,5,8],[5,9,5,10],[5,11,5,12],[5,13,5,14],[10,0,10,1],[12,0,12,7],[14,0,14,4],[14,5,14,6],[10,15,10,18],[19,15,19,16],[24,0,24,5],[24,13,24,14],[24,15,24,16],[24,17,24,18],[22,15,22,18],[20,0,20,5],[20,6,20,12],[23,0,23,1],[19,0,19,5],[23,15,23,18],[20,13,20,14],[20,15,20,16],[20,17,20,18],[21,0,21,18],[19,13,19,14],[19,17,19,18],[23,2,23,4],[23,5,23,7],[23,8,23,10],[19,6,19,12],[24,6,24,12],[23,11,23,14],[22,0,22,1],[22,5,22,7],[34,16,34,17],[30,5,33,9],[30,0,33,4],[34,0,34,4],[34,5,34,9],[37,10,38,11],[37,12,38,13],[37,14,38,15],[37,16,38,17],[32,12,33,13],[32,14,33,15],[32,16,33,17],[35,0,36,4],[37,0,38,4],[35,5,36,9],[37,5,38,9],[35,10,36,11],[35,12,36,13],[35,14,36,15],[35,16,36,17],[32,18,33,18],[40,16,40,17],[40,12,40,13],[40,14,40,15],[43,0,43,18],[40,18,41,18],[41,12,41,13],[41,14,41,15],[41,16,41,17],[40,0,41,4],[40,5,40,10],[41,5,41,10],[42,0,42,9],[42,10,42,11],[42,12,42,16],[42,17,42,18],[39,0,39,9],[39,10,39,11],[39,12,39,13],[39,14,39,15],[39,16,39,17],[34,10,34,11],[34,12,34,13],[34,14,34,15],[83,20,84,21],[85,20,86,21],[87,20,87,21],[91,11,92,14],[91,15,92,18],[91,0,92,4],[91,5,92,10],[88,0,88,18],[89,0,90,2],[89,3,90,3],[89,4,90,6],[89,7,90,10],[89,11,90,14],[89,15,90,18],[53,14,53,15],[53,16,53,17],[51,0,52,1],[51,2,52,4],[51,5,52,11],[51,12,51,13],[51,14,51,15],[51,16,51,17],[81,20,82,21],[81,19,82,19],[65,0,66,18],[57,0,57,18],[58,0,58,3],[58,4,58,6],[58,7,58,9],[58,10,59,11],[58,12,58,14],[58,15,58,16],[58,17,58,18],[59,0,59,3],[59,4,59,6],[59,7,59,9],[59,12,59,14],[59,15,59,16],[49,2,50,4],[49,5,50,11],[49,12,49,13],[49,14,49,15],[54,0,54,11],[49,16,49,17],[25,0,25,5],[25,6,25,12],[25,13,25,14],[25,15,25,16],[25,17,25,18],[26,0,26,18],[27,0,28,4],[27,5,28,5],[27,6,28,9],[27,10,28,10],[27,11,28,12],[27,13,28,18],[51,18,52,18],[52,12,52,13],[52,14,52,15],[52,16,52,17],[53,0,53,11],[53,12,53,13],[44,14,44,15],[67,0,68,1],[67,2,68,6],[67,7,68,9],[67,10,68,15],[67,16,68,18],[69,0,70,1],[69,16,71,18],[72,0,72,18],[47,12,47,13],[47,14,47,15],[47,16,47,17],[47,18,48,18],[48,12,48,13],[48,14,48,15],[48,16,48,17],[55,0,56,6],[55,7,56,8],[55,9,56,15],[55,16,56,18],[54,12,54,13],[54,14,54,15],[54,16,54,17],[49,0,50,1],[35,18,36,18],[37,18,38,18],[49,18,50,18],[50,12,50,13],[50,14,50,15],[50,16,50,17],[47,0,48,1],[47,2,48,4],[47,5,48,11],[44,16,44,17],[45,0,46,1],[45,2,46,4],[45,5,46,11],[45,12,45,13],[45,14,45,15],[45,16,45,17],[45,18,46,18],[46,12,46,13],[46,16,46,17],[46,14,46,15],[44,0,44,1],[44,2,44,4],[44,5,44,11],[44,12,44,13]]}
[null,null,null,null,"COMISIÓN NACIONAL DEL SERVICIO CIVIL"]
[]
[]
[null,null,null,null,"FORMATO 11. EVALUACIÓN PERÍODO DE PRUEBA"]
[]
[null,null,null,null,"PROCESO: EVALUACIÓN DEL DESEMPEÑO LABORAL",null,null,"Código:  ",null,"F-ED-012",null,"Página",null,"1 de 1"]
[null,null,null,null,null,null,null,"Fecha de emisión: ",null,"2016-02-10",null,"Versión: ",null,"1.0"]
["PERÍODO DE EVALUACIÓN",null,null,null,"DÍA","MES","AÑO","al",null,"DÍA","MES","AÑO","FECHA DE EVALUACIÒN",null,null,null,"DÍA","MES","AÑO"]
[]
["I. IDENTIFICACIÓN DEL EVALUADO"]
["Tipo de Documento",null,"Número de identificación",null,null,"Primer apellido",null,null,"Segundo apellido",null,null,"Primer nombre",null,null,null,"Otros nombres"]
["CEDULA DE CIUDADANIA"]
["Dependencia o área a la que pertenece el evaluado",null,null,null,null,null,null,null,"Denominación del empleo"]
[]
["Nivel jerárquico",null,null,null,null,"Código",null,"Grado","Propósito del empleo:  "]
[]
["II. IDENTIFICACIÓN EVALUADOR. (Jefe inmediato del evaluado en caso de constituir Comisión Evaluadora)"]
["Tipo de documento",null,"Número de identificación",null,null,"Primer apellido",null,null,"Segundo apellido",null,null,"Primer nombre",null,null,null,"Otros nombres"]
["CEDULA DE CIUDADANIA"]
[" Área o Dependencia a la que pertenece el evaluador",null,null,null,null,null,"Denominación del empleo",null,null,null,null,null,null,"Código",null,"Grado",null,"Nivel jerárquico"]
[]
["III. IDENTIFICACIÓN EVALUADOR "]
["Tipo de documento",null,"Número de identificación",null,null,"Primer apellido",null,null,"Segundo apellido",null,null,"Primer nombre",null,null,null,"Otros nombres"]
["CEDULA DE CIUDADANIA"]
["Dependencia o área a la que pertenece el evaluador",null,null,null,null,null,"Denominación del empleo",null,null,null,null,null,null,"Código",null,"Grado",null,"Nivel jerárquico"]
[]
[]
["CONCERTACIÓN DE COMPROMISOS",null,null,null,null,null,"AJUSTE DE COMPROMISOS",null,null,null,null,"SELECCIONE LA RAZÓN DEL AJUSTE DE LOS COMPROMISOS"]
[]
["IV. COMPROMISOS LABORALES"]
["Funciones Esenciales del empleo.",null,null,null,null,"Compromisos Laborales.",null,null,null,null,"Peso porcentual del compromiso",null,"Calificación de la evaluaciones  Eventuales"]
[]
[null,null,null,null,null,null,null,null,null,null,null,null,"1°",null,"2°",null,"3°.",null,"Total"]
[]
[null,null,null,null,null,null,null,null,null,null,null,null,null,null,null,null,null,null,{"$f":"+M35*M$42+O35*O$42+Q35*Q$42","v":0}]
[null,null,null,null,null,null,null,null,null,null,null,null,null,null,null,null,null,null,{"$f":"+M36*M$42+O36*O$42+Q36*Q$42","v":0}]
[]
[null,null,null,null,null,null,null,null,null,null,null,null,null,null,null,null,null,null,{"$f":"+M38*M$42+O38*O$42+Q38*Q$42","v":0}]
[]
["TOTALES",null,null,null,null,null,null,null,null,null,{"$f":"IF(SUM(K35:L39)>1,CONCATENATE(\"ERROR!!: Sumatoria mayor a 100% (\",TEXT(SUM(K35:L39),\"0%)\")),IF(SUM(K35:L39)<1,CONCATENATE(\"ERROR!!: Sumatoria menor a 100% (\",TEXT(SUM(K35:L39),\"0%)\")),SUM(K35:L39)))","v":"ERROR!!: Sumatoria menor a 100% (0%)"},null,{"$f":"+M35*$K35+M36*$K36+M38*$K38","v":0},null,{"$f":"+O35*$K35+O36*$K36+O38*$K38","v":0},null,{"$f":"+Q35*$K35+Q36*$K36+Q38*$K38","v":0},null,{"$f":"+S35*$K35+S36*$K36+S38*$K38","v":0}]
["Días Efectivamente Laborados",null,null,null,null,"Total Días Laborados de cada Evaluación Eventual",null,null,null,null,null,{"$f":"IF(SUM(M41:R41)<=30,\"No Aplica\",SUM(M41:R41))","v":"No Aplica"}]
[null,null,null,null,null,"% Participación Días Laborados de cada Evalución Eventual",null,null,null,null,null,{"$f":"IFERROR(+L41/$L$41,0)","v":0},{"$f":"IFERROR(+M41/$L$41,0)","v":0},null,{"$f":"IFERROR(+O41/$L$41,0)","v":0},null,{"$f":"IFERROR(+Q41/$L$41,0)","v":0}]
["CALIFICACIÓN COMPROMISOS LABORALES (Sobre 100)",null,null,null,null,null,null,null,null,null,{"$f":"(+M40*M42+O40*O42+Q40*Q42)","v":0},null,"CALIFICACIÓN COMPROMISOS LABORALES\n(Sobre 85%)",null,null,null,null,{"$f":"+K43*85%","v":0}]
["V. COMPETENCIAS COMPORTAMENTALES"]
["COMPETENCIA",null,"DEFINICIÓN ",null,null,"CONDUCTAS ASOCIADAS",null,null,null,null,null,null,"1a.",null,"2a.",null,"3a.",null,"Total"]
[null,null,{"$f":"VLOOKUP(A46,Hoja4!A220:C242,2,FALSE)","v":{"$error":"#N/A"}},null,null,{"$f":"VLOOKUP(A46,Hoja4!A$220:C$242,3,FALSE)","v":{"$error":"#N/A"}},null,null,null,null,null,null,null,null,null,null,null,null,{"$f":"+M47*M55+O47*O55+Q47*Q55","v":0}]
[null,null,null,null,null,null,null,null,null,null,null,null,{"$f":"IFERROR(VLOOKUP(M46,Hoja4!$A$452:$B$456,2,FALSE),0)","v":0},null,{"$f":"IFERROR(VLOOKUP(O46,Hoja4!$A$452:$B$456,2,FALSE),0)","v":0},null,{"$f":"IFERROR(VLOOKUP(Q46,Hoja4!$A$452:$B$456,2,FALSE),0)","v":0}]
[null,null,{"$f":"VLOOKUP(A48,Hoja4!A$220:C$242,2,FALSE)","v":{"$error":"#N/A"}},null,null,{"$f":"VLOOKUP(A48,Hoja4!A$220:C$242,3,FALSE)","v":{"$error":"#N/A"}},null,null,null,null,null,null,null,null,null,null,null,null,{"$f":"+M49*M$55+O49*O$55+Q49*Q$55","v":0}]
[null,null,null,null,null,null,null,null,null,null,null,null,{"$f":"IFERROR(VLOOKUP(M48,Hoja4!$A$452:$B$456,2,FALSE),0)","v":0},null,{"$f":"IFERROR(VLOOKUP(O48,Hoja4!$A$452:$B$456,2,FALSE),0)","v":0},null,{"$f":"IFERROR(VLOOKUP(Q48,Hoja4!$A$452:$B$456,2,FALSE),0)","v":0}]
[null,null,{"$f":"VLOOKUP(A50,Hoja4!A$220:C$242,2,FALSE)","v":{"$error":"#N/A"}},null,null,{"$f":"VLOOKUP(A50,Hoja4!A$220:C$242,3,FALSE)","v":{"$error":"#N/A"}},null,null,null,null,null,null,null,null,null,null,null,null,{"$f":"+M51*M$55+O51*O$55+Q51*Q$55","v":0}]
[null,null,null,null,null,null,null,null,null,null,null,null,{"$f":"IFERROR(VLOOKUP(M50,Hoja4!$A$452:$B$456,2,FALSE),0)","v":0},null,{"$f":"IFERROR(VLOOKUP(O50,Hoja4!$A$452:$B$456,2,FALSE),0)","v":0},null,{"$f":"IFERROR(VLOOKUP(Q50,Hoja4!$A$452:$B$456,2,FALSE),0)","v":0}]
[null,null,{"$f":"VLOOKUP(A52,Hoja4!A$220:C$242,2,FALSE)","v":{"$error":"#N/A"}},null,null,{"$f":"VLOOKUP(A52,Hoja4!A$220:C$242,3,FALSE)","v":{"$error":"#N/A"}},null,null,null,null,null,null,null,null,null,null,null,null,{"$f":"+M53*M$55+O53*O$55+Q53*Q$55","v":0}]
[null,null,null,null,null,null,null,null,null,null,null,null,{"$f":"IFERROR(VLOOKUP(M52,Hoja4!$A$452:$B$456,2,FALSE),0)","v":0},null,{"$f":"IFERROR(VLOOKUP(O52,Hoja4!$A$452:$B$456,2,FALSE),0)","v":0},null,{"$f":"IFERROR(VLOOKUP(Q52,Hoja4!$A$452:$B$456,2,FALSE),0)","v":0}]
["PONDERACIÓN POR EVALUACIÓN EVENTUAL",null,null,null,null,null,null,null,null,null,null,null,{"$f":"+(M47+M49+M51+M53)/4","v":0},null,{"$f":"+(O47+O49+O51+O53)/4","v":0},null,{"$f":"+(Q47+Q49+Q51+Q53)/4","v":0},null,{"$f":"+(S46+S48+S50+S52)/4","v":0}]
["% Participación Días Laborados de cada Ev. Eventual",null,null,null,null,null,null,null,null,null,null,null,{"$f":"+M42","v":0},null,{"$f":"+O42","v":0},null,{"$f":"+Q42","v":0},null,{"$f":"SUM(M55:R55)","v":0}]
["CALIFICACIÓN COMPETENCIAS COMPORTAMENTALES",null,null,null,null,null,null,{"$f":"+S54","v":0},null,"CALIFICACIÓN TOTAL PERÍODO DE PRUEBA",null,null,null,null,null,null,{"$f":"+H56+R43","v":0}]
[]
["VI. FIRMAS, RECLAMACIÓN U OBJECIÓN EN LA CONCERTACIÒN DE COMPROMISOS."]
["FIRMA DEL EVALUADO",null,null,null,"FIRMA DEL JEFE INMEDIATO",null,null,"FIRMA DEL FUNCIONARIO DE LIBRE NOMBRAMIENTO Y REMOCIÓN ",null,null,"Renuencia del Evaluado para firmar la fijación de compromisos",null,"NOMBRE DEL TESTIGO",null,null,"FIRMA DEL TESTIGO",null,"FECHA"]
[]
["RECLAMACIÓN U OBJECIÓN EN ÚNICA INSTANCIA ANTE LA COMISIÓN DE PERSONAL (Paràgrafo del articulo 31º, del Acuerdo 565 de 2016)",null,null,null,null,null,"DECISIÓN DE LA COMISIÓN DE PERSONAL",null,null,null,null,null,"MOTIVACIÓN DE LA DECISIÓN"]
[]
[]
["Número de Radicado"]
["Fecha Reclamación (dd/mm/aa)"]
["VII. NOTIFICACIÓN"]
[]
["Nombre del Evaluado:",null,null,null,null,null,null,"Nombre del evaluador:",null,null,null,null,null,null,null,null,"RECURSO"]
[]
["Firma"]
[null,null,null,null,null,null,null,"Firma"]
[]
["VIII. DECISIÓN DE RECURSOS"]
["RECURSO DE REPOSICIÓN"]
["DECISIÓN",null,null,null,null,null,null,null,null,null,null,null,null,"FECHA"]
[]
[null,null,null,null,"Nombre del Evaluado:"]
[]
[null,null,null,null,"Firma"]
[]
[]
[null,null,null,null,"Nombre del Notificador:"]
[]
[null,null,null,null,"Firma"]
[]
[]
["MOTIVACIÓN (Anexar Acto Administrativo):"]
[]
["IX. CALIFICACIÓN DEFINITIVA"]
["CALIFICACIÓN DEFINITIVA EN FIRME",null,null,null,"FIRMA Y NÚMERO DE CÉDULA DEL NOTIFICADO",null,null,null,null,null,null,"FIRMA Y NÚMERO DE CÉDULA DEL NOTIFICADOR"]
[]
["F1. INF. GENERAL'!A1",null,null,null,null,"F4. CALF. COM. COMPORT.'!A1",null,null,null,null,null,"F3. EVIDENCIAS'!A1",null,null,null,"F7. PLAN DE MEJORAMIENTO'!A1"]

{"sheet":"F. EVA ÁREAS O DEP, CACI","index":13,"n_rows":65,"n_cols":5,"rows_kept":65,"cut":false,"hidden":true,"merged":[[49,0,61,4],[62,0,63,4],[64,0,69,4],[30,1,30,2],[31,1,31,2],[32,1,32,2],[33,1,33,2],[34,1,34,2],[35,0,48,4],[29,1,29,2],[4,0,5,4],[6,0,9,4],[11,0,12,1],[11,2,12,4],[13,0,21,4],[22,0,23,0],[22,1,22,4],[23,1,23,2],[24,1,24,2],[25,1,25,2],[26,1,26,2],[27,1,27,2],[28,1,28,2]]}
[]
[]
[]
[]
["CONSEJO ASESOR DEL GOBIERNO NACIONAL EN MATERIA DE CONTROL INTERNO DE LAS ENTIDADES DEL ORDEN NACIONAL Y TERRITORIAL"]
[]
["FORMATO \nEVALUACIÓN DE GESTIÓN POR DEPENDENCIA\nOFICINA DE CONTROL INTERNO"]
[]
[]
[]
[]
["1. ENTIDAD:",null,"2. DEPENDENCIA A EVALUAR:"]
[]
["3. OBJETIVOS INSTITUCIONALES RELACIONADOS CON LA DEPENDENCIA:"]
[]
[]
[]
[]
[]
[]
[]
[]
["4. COMPROMISOS ASOCIADOS AL CUMPLIMIENTO DEL OBJETIVO INSTITUCIONAL","5. MEDICIÓN DE COMPROMISOS"]
[null,"5.1. INDICADOR",null,"5.2. RESULTADO (%)","5.3. ANÁLISIS DEL RESULTADOS"]
[]
[]
[]
[]
[]
[]
[]
[]
[]
[]
[]
[]
[]
[]
[]
[]
[]
[]
[]
[]
[]
[]
[]
[]
[]
["7. RECOMENDACIONES DE MEJORAMIENTO DE LA OFICINA DE CONTROL INTERNO:"]
[]
[]
[]
[]
[]
[]
[]
[]
[]
[]
[]
[]
["8. FECHA:"]
[]
["9. FIRMA:"]